program: Orca
programVersion: 5.0.2
elementType: Cl S O N N C C C C C C C C C C C C C C C C C C C H H H H H H H H H H H H H H H H H H H H H H H H H
charge: 0
multiplicity: 1
keywords: wb97x-d3
keywords: def2-TZVPP
keywords: def2/J RIJCOSX
keywords: DEFGRID2
keywords: scfconv7
keywords: smallprint printgap noloewdin
keywords: NOSOSCF
formula: C19H25ClN2OS
InChI: InChI=1/C19H25ClN2OS/c1-18(2,3)14-9-7-13(8-10-14)12-24-15-11-21-22(19(4,5)6)17(23)16(15)20/h7-11H,12H2,1-6H3
49 atoms
Cl 0.288166 -0.760537 2.023538
S  -0.33556 -3.351703 0.121998
O  -1.407719 1.471182 1.383733
N  -2.750928 0.428159 -0.153412
N  -3.050746 -0.633772 -0.887349
C  3.644267 1.894473 0.096663
C  -3.617806 1.638487 -0.383002
C  2.967267 0.602731 -0.345362
C  4.033241 2.726147 -1.130717
C  2.656678 2.690846 0.95921
C  4.903042 1.636575 0.922507
C  -4.293964 2.050748 0.925626
C  -4.71426 1.295934 -1.387105
C  -2.774748 2.77184 -0.968193
C  1.798887 0.659854 -1.107155
C  3.440107 -0.660838 0.004827
C  1.567263 -1.742768 -1.070435
C  1.113137 -0.487928 -1.468228
C  2.749541 -1.812024 -0.344695
C  -1.710746 0.469215 0.749779
C  0.746686 -2.960835 -1.325224
C  -1.267377 -1.85901 0.118485
C  -0.97545 -0.782479 0.885595
C  -2.359729 -1.715026 -0.776601
H  4.513421 3.65664 -0.820697
H  4.736049 2.186739 -1.768289
H  3.167083 2.992604 -1.737926
H  3.114369 3.621071 1.302347
H  1.752414 2.953631 0.408127
H  2.353708 2.12172 1.840359
H  5.348292 2.587575 1.219121
H  4.688538 1.079455 1.836298
H  5.658601 1.084856 0.360367
H  -4.990261 2.862704 0.715017
H  -3.598052 2.40652 1.68001
H  -4.869224 1.224524 1.345252
H  -5.32437 2.190225 -1.514279
H  -5.368757 0.497616 -1.039961
H  -4.322433 1.022281 -2.365073
H  -2.288015 2.45815 -1.892689
H  -2.014652 3.141384 -0.285224
H  -3.432184 3.607624 -1.209316
H  1.399288 1.617635 -1.417748
H  4.350928 -0.765901 0.578537
H  0.204638 -0.404674 -2.054181
H  3.128297 -2.77667 -0.027057
H  0.115593 -2.858222 -2.207535
H  1.358544 -3.855589 -1.44736
H  -2.659674 -2.538379 -1.410891
elementType: Cl S O N C H
totalener: -1782.29471654 hartree
nucrepener: 2535.26591668 hartree
electener: -4317.56063322 hartree
oneelecener: -7482.61712753 hartree
twoeener: 3165.05649432 hartree
cpcmener: -0.02960274 hartree
kineticenergy: 1776.74630673 hartree
xcener: -132.576758996833 hartree
chargesum: 0.0000000
charge: -0.032773 -0.106836 -0.540908 0.143851 -0.267659 0.359155 0.176810 -0.087683 -0.327658 -0.339017 -0.358839 -0.328198 -0.247070 -0.329915 -0.203848 -0.163958 0.030017 -0.212796 -0.191295 0.338875 -0.130604 0.059447 -0.014776 -0.044468 0.098042 0.101136 0.096995 0.099648 0.097950 0.093286 0.100714 0.099957 0.101360 0.103061 0.109576 0.107461 0.097480 0.101292 0.100669 0.108124 0.107962 0.104837 0.142253 0.146361 0.152564 0.137017 0.141047 0.142723 0.128632
qa: -0.0328 -0.1068 -0.5409 0.1439 -0.2677 0.3592 0.1768 -0.0877 -0.3277 -0.3390 -0.3588 -0.3282 -0.2471 -0.3299 -0.2038 -0.1640 0.0300 -0.2128 -0.1913 0.3389 -0.1306 0.0594 -0.0148 -0.0445 0.0980 0.1011 0.0970 0.0996 0.0980 0.0933 0.1007 0.1000 0.1014 0.1031 0.1096 0.1075 0.0975 0.1013 0.1007 0.1081 0.1080 0.1048 0.1423 0.1464 0.1526 0.1370 0.1410 0.1427 0.1286
va: 1.3115 2.1963 1.9515 3.2411 2.9413 3.5820 3.8288 3.6880 3.9151 3.9270 3.9292 3.9029 3.8440 3.9097 3.9754 3.8906 3.5431 3.9237 4.0077 4.2522 3.9123 3.7906 3.9839 4.1375 1.0032 1.0038 1.0042 1.0072 1.0030 1.0098 1.0067 1.0004 1.0007 1.0034 1.0214 1.0038 1.0040 1.0140 1.0146 1.0034 1.0214 1.0035 1.0009 0.9973 0.9919 1.0067 1.0030 0.9987 1.0132
dispcorr: -0.029832761 hartree
energy: -1782.324549301990
dipole: 6.29692 -6.74478 -0.44786 29.77466 -30.27598 -0.50131 -12.33370 10.53684 -1.79686
magnitude: 1.91849 au
magnitude: 4.87642 debye
