program: Orca
programVersion: 5.0.2
elementType: Cl S O N N C C C C C C C C C C C C C C C C C C C H H H H H H H H H H H H H H H H H H H H H H H H H
charge: 0
multiplicity: 1
keywords: wb97x-d3
keywords: def2-TZVPP
keywords: def2/J RIJCOSX
keywords: DEFGRID2
keywords: scfconv7
keywords: smallprint printgap noloewdin
keywords: NOSOSCF
formula: C19H25ClN2OS
InChI: InChI=1/C19H25ClN2OS/c1-18(2,3)14-9-7-13(8-10-14)12-24-15-11-21-22(19(4,5)6)17(23)16(15)20/h7-11H,12H2,1-6H3
49 atoms
Cl -1.468911 -1.544646 -2.706714
S  -0.248443 -3.39823 -0.384892
O  -2.623168 0.89538 -1.68111
N  -2.237861 0.519348 0.548101
N  -1.790637 -0.259714 1.520414
C  3.38391 2.21898 0.141606
C  -2.814469 1.839275 0.986406
C  2.883366 0.783947 0.255076
C  3.808625 2.575929 -1.281238
C  2.256555 3.171702 0.560572
C  4.587964 2.419221 1.069351
C  -2.725869 1.953092 2.50548
C  -4.288811 1.921533 0.589778
C  -1.999619 2.983453 0.381119
C  2.802648 -0.082562 -0.834808
C  2.456825 0.295359 1.490465
C  1.853622 -1.836734 0.528409
C  2.295542 -1.367885 -0.703259
C  1.948299 -0.986857 1.625635
C  -2.195098 0.176395 -0.787521
C  1.234137 -3.191666 0.679021
C  -1.063566 -1.881389 -0.070338
C  -1.568671 -1.105855 -1.059699
C  -1.238634 -1.391418 1.253218
H  4.625679 1.946683 -1.638347
H  2.983232 2.493045 -1.990588
H  4.157883 3.609318 -1.309569
H  1.382056 3.054702 -0.082681
H  1.93812 3.00156 1.589929
H  2.588007 4.209594 0.486916
H  4.94474 3.449308 1.007445
H  4.33899 2.222081 2.112888
H  5.415315 1.763487 0.792682
H  -3.14823 2.919434 2.781391
H  -1.699862 1.924944 2.869768
H  -3.298139 1.183594 3.021076
H  -4.710406 2.839256 1.000464
H  -4.852135 1.085379 1.006004
H  -4.445661 1.94349 -0.484989
H  -2.078911 3.046123 -0.70069
H  -0.944382 2.895391 0.646376
H  -2.364067 3.92588 0.791298
H  3.124978 0.239153 -1.815731
H  2.502611 0.925876 2.369957
H  2.227148 -2.001358 -1.579822
H  1.611403 -1.327765 2.597397
H  1.898068 -3.988763 0.339181
H  0.981563 -3.399459 1.717767
H  -0.915036 -1.97018 2.107425
elementType: Cl S O N C H
totalener: -1782.29730784 hartree
nucrepener: 2510.05098900 hartree
electener: -4292.34829684 hartree
oneelecener: -7431.73638909 hartree
twoeener: 3139.38809225 hartree
cpcmener: -0.03083197 hartree
kineticenergy: 1776.73410296 hartree
xcener: -132.577648628362 hartree
chargesum: -0.0000000
charge: -0.047202 -0.081129 -0.542384 0.136699 -0.248299 0.346852 0.178839 -0.101539 -0.357367 -0.348142 -0.328416 -0.241875 -0.330800 -0.328829 -0.137214 -0.172782 0.031592 -0.238034 -0.212612 0.360529 -0.092050 0.139021 -0.092021 -0.122585 0.101976 0.100819 0.100412 0.101563 0.101462 0.102298 0.098074 0.097644 0.101327 0.097456 0.099301 0.100663 0.103082 0.107229 0.108529 0.110316 0.097950 0.105649 0.146987 0.142842 0.131061 0.146113 0.148903 0.131112 0.146982
qa: -0.0472 -0.0811 -0.5424 0.1367 -0.2483 0.3469 0.1788 -0.1015 -0.3574 -0.3481 -0.3284 -0.2419 -0.3308 -0.3288 -0.1372 -0.1728 0.0316 -0.2380 -0.2126 0.3605 -0.0920 0.1390 -0.0920 -0.1226 0.1020 0.1008 0.1004 0.1016 0.1015 0.1023 0.0981 0.0976 0.1013 0.0975 0.0993 0.1007 0.1031 0.1072 0.1085 0.1103 0.0979 0.1056 0.1470 0.1428 0.1311 0.1461 0.1489 0.1311 0.1470
va: 1.2976 2.3017 1.9580 3.2188 2.9256 3.6072 3.8262 3.7332 3.9272 3.9247 3.9170 3.8418 3.9074 3.9074 3.8829 3.9648 3.5386 4.0091 3.9555 4.2633 3.8964 3.7861 3.9371 4.1560 1.0005 1.0007 1.0070 0.9993 1.0019 1.0062 1.0032 1.0038 1.0038 1.0043 1.0144 1.0148 1.0029 1.0037 1.0224 1.0226 1.0036 1.0049 0.9977 1.0020 1.0210 1.0031 0.9971 1.0097 0.9965
dispcorr: -0.028356140 hartree
energy: -1782.325663978138
dipole: 17.32774 -16.01538 1.31236 36.40280 -36.55548 -0.15268 20.20102 -17.75974 2.44127
magnitude: 2.77586 au
magnitude: 7.05568 debye
