program: Orca
programVersion: 5.0.2
elementType: Cl S O N N C C C C C C C C C C C C C C C C C C C H H H H H H H H H H H H H H H H H H H H H H H H H
charge: 0
multiplicity: 1
keywords: wb97x-d3
keywords: def2-TZVPP
keywords: def2/J RIJCOSX
keywords: DEFGRID2
keywords: scfconv7
keywords: smallprint printgap noloewdin
keywords: NOSOSCF
formula: C19H25ClN2OS
InChI: InChI=1/C19H25ClN2OS/c1-18(2,3)14-9-7-13(8-10-14)12-24-15-11-21-22(19(4,5)6)17(23)16(15)20/h7-11H,12H2,1-6H3
49 atoms
Cl 0.057522 -1.293725 2.33197
S  -0.34686 -3.524716 -0.023347
O  -1.291889 1.170333 1.703944
N  -2.401068 0.464327 -0.174036
N  -2.66171 -0.473958 -1.070808
C  2.998075 2.092246 0.146748
C  -3.021634 1.808219 -0.448463
C  2.501731 0.748368 -0.371547
C  2.368086 3.268968 -0.595846
C  2.622039 2.203977 1.630474
C  4.520355 2.183021 -0.004975
C  -1.913145 2.801011 -0.798895
C  -3.848299 2.272393 0.751607
C  -3.964038 1.698351 -1.643391
C  1.529596 0.630669 -1.360153
C  2.991303 -0.436008 0.189246
C  1.480837 -1.776659 -1.129293
C  1.030728 -0.611896 -1.735756
C  2.488712 -1.671446 -0.173487
C  -1.557141 0.284753 0.90183
C  0.808141 -3.081352 -1.400552
C  -1.193717 -1.983831 0.048268
C  -0.972537 -1.045976 0.998566
C  -2.101565 -1.630438 -0.983746
H  2.749089 4.206189 -0.187009
H  2.604176 3.257517 -1.661531
H  1.281074 3.28812 -0.491743
H  2.939902 3.167368 2.034585
H  1.541824 2.122333 1.769163
H  3.09294 1.423921 2.230614
H  4.883646 3.139631 0.376333
H  5.037652 1.395914 0.545204
H  4.818413 2.1089 -1.052539
H  -2.366145 3.755642 -1.067762
H  -1.33931 2.453258 -1.659319
H  -1.225727 2.984499 0.02372
H  -4.393345 3.172595 0.466718
H  -3.251101 2.517466 1.624179
H  -4.585047 1.519353 1.034049
H  -4.780978 0.998824 -1.469012
H  -3.455912 1.415029 -2.563073
H  -4.403108 2.683741 -1.799643
H  1.127172 1.509708 -1.845126
H  3.760914 -0.395878 0.950702
H  0.258545 -0.665719 -2.494533
H  2.861667 -2.564331 0.314307
H  0.251285 -3.066093 -2.336616
H  1.508702 -3.9170 -1.43479
H  -2.358677 -2.342609 -1.75608
elementType: Cl S O N C H
totalener: -1782.29370707 hartree
nucrepener: 2583.89805802 hartree
electener: -4366.19176509 hartree
oneelecener: -7579.88349408 hartree
twoeener: 3213.69172899 hartree
cpcmener: -0.02885994 hartree
kineticenergy: 1776.74683237 hartree
xcener: -132.577710035632 hartree
chargesum: 0.0000000
charge: -0.037510 -0.104490 -0.538931 0.155821 -0.261949 0.357411 0.197284 -0.056321 -0.348528 -0.333991 -0.330566 -0.357989 -0.323861 -0.249724 -0.234925 -0.164065 0.051837 -0.153216 -0.254314 0.295322 -0.128871 0.077574 -0.007746 -0.050025 0.102435 0.103626 0.087908 0.099633 0.083592 0.099002 0.097244 0.096941 0.101334 0.113111 0.106750 0.107117 0.103929 0.109637 0.107204 0.103043 0.100089 0.098296 0.147459 0.141103 0.145876 0.131350 0.136580 0.145355 0.133157
qa: -0.0375 -0.1045 -0.5389 0.1558 -0.2619 0.3574 0.1973 -0.0563 -0.3485 -0.3340 -0.3306 -0.3580 -0.3239 -0.2497 -0.2349 -0.1641 0.0518 -0.1532 -0.2543 0.2953 -0.1289 0.0776 -0.0077 -0.0500 0.1024 0.1036 0.0879 0.0996 0.0836 0.0990 0.0972 0.0969 0.1013 0.1131 0.1068 0.1071 0.1039 0.1096 0.1072 0.1030 0.1001 0.0983 0.1475 0.1411 0.1459 0.1314 0.1366 0.1454 0.1332
va: 1.2986 2.2101 1.9465 3.2353 2.9443 3.5854 3.8048 3.6611 3.9311 3.9218 3.9141 3.9256 3.8972 3.8486 3.9058 3.9260 3.5115 3.9356 4.0280 4.3003 3.9046 3.8308 3.9500 4.1214 1.0079 1.0011 1.0028 1.0073 1.0208 1.0031 1.0031 1.0044 1.0033 1.0075 1.0020 1.0143 1.0030 1.0216 1.0038 1.0132 1.0140 1.0043 0.9967 1.0013 1.0036 1.0121 1.0029 0.9973 1.0090
dispcorr: -0.032184318 hartree
energy: -1782.325891388152
dipole: 6.81170 -7.01402 -0.20232 34.68113 -34.90200 -0.22088 -13.48369 11.43466 -2.04903
magnitude: 2.07081 au
magnitude: 5.26358 debye
