program: Orca
programVersion: 5.0.2
elementType: Cl S O N N C C C C C C C C C C C C C C C C C C C H H H H H H H H H H H H H H H H H H H H H H H H H
charge: 0
multiplicity: 1
keywords: wb97x-d3
keywords: def2-TZVPP
keywords: def2/J RIJCOSX
keywords: DEFGRID2
keywords: scfconv7
keywords: smallprint printgap noloewdin
keywords: NOSOSCF
formula: C19H25ClN2OS
InChI: InChI=1/C19H25ClN2OS/c1-18(2,3)14-9-7-13(8-10-14)12-24-15-11-21-22(19(4,5)6)17(23)16(15)20/h7-11H,12H2,1-6H3
49 atoms
Cl -1.285243 -2.288545 2.370142
S  -0.272139 -3.382347 -0.557599
O  -2.367857 0.379459 2.194794
N  -2.245377 0.624741 -0.082954
N  -1.888051 0.163795 -1.270223
C  3.25902 2.315663 -0.880094
C  -2.856419 2.002107 -0.078631
C  2.793127 0.892499 -0.595642
C  3.863469 2.461081 -2.275512
C  2.059269 3.264647 -0.770335
C  4.32152 2.719451 0.14959
C  -4.267043 1.939897 0.507704
C  -2.965907 2.517317 -1.510253
C  -1.954989 2.959686 0.7004
C  2.231155 0.582845 0.643885
C  2.889655 -0.140246 -1.527505
C  1.875154 -1.716948 -0.002887
C  1.781102 -0.694157 0.936723
C  2.434484 -1.41971 -1.239965
C  -2.063033 -0.067088 1.097263
C  1.331746 -3.075336 0.297024
C  -1.077946 -1.847365 -0.275755
C  -1.475134 -1.387538 0.934392
C  -1.329014 -0.992311 -1.380517
H  3.146628 2.221382 -3.06272
H  4.183446 3.492796 -2.430177
H  4.739726 1.824806 -2.411325
H  2.36905 4.293037 -0.96861
H  1.282547 3.005152 -1.492377
H  1.611737 3.243466 0.224424
H  4.670081 3.736018 -0.044315
H  3.935487 2.696279 1.169411
H  5.187845 2.056948 0.104962
H  -4.729144 2.922165 0.406024
H  -4.287985 1.676985 1.560978
H  -4.885222 1.22793 -0.040707
H  -3.602681 1.893346 -2.135181
H  -1.997602 2.625224 -1.995905
H  -3.420772 3.50666 -1.46097
H  -2.361053 3.968037 0.614226
H  -0.946937 2.974436 0.281693
H  -1.887511 2.722983 1.75863
H  2.134926 1.349058 1.403399
H  3.321521 0.040575 -2.502346
H  1.357653 -0.895925 1.913329
H  2.515071 -2.19393 -1.994067
H  1.975934 -3.865878 -0.090562
H  1.21112 -3.23722 1.36636
H  -1.047408 -1.292892 -2.380407
elementType: Cl S O N C H
totalener: -1782.29623319 hartree
nucrepener: 2520.78737634 hartree
electener: -4303.08360953 hartree
oneelecener: -7453.06105591 hartree
twoeener: 3149.97744638 hartree
cpcmener: -0.02623912 hartree
kineticenergy: 1776.73795326 hartree
xcener: -132.575752554878 hartree
chargesum: 0.0000000
charge: -0.037767 -0.091715 -0.534836 0.150783 -0.261063 0.350286 0.176241 -0.082301 -0.359321 -0.344310 -0.330375 -0.330879 -0.244042 -0.321155 -0.219573 -0.148032 0.054632 -0.198805 -0.208167 0.351549 -0.153664 0.109692 -0.080136 -0.065118 0.100621 0.101011 0.102349 0.103634 0.100936 0.094680 0.098523 0.097454 0.101932 0.103192 0.110079 0.107641 0.101804 0.099792 0.097448 0.106126 0.092998 0.110243 0.144142 0.147914 0.145755 0.136463 0.148992 0.137232 0.127113
qa: -0.0378 -0.0917 -0.5348 0.1508 -0.2611 0.3503 0.1762 -0.0823 -0.3593 -0.3443 -0.3304 -0.3309 -0.2440 -0.3212 -0.2196 -0.1480 0.0546 -0.1988 -0.2082 0.3515 -0.1537 0.1097 -0.0801 -0.0651 0.1006 0.1010 0.1023 0.1036 0.1009 0.0947 0.0985 0.0975 0.1019 0.1032 0.1101 0.1076 0.1018 0.0998 0.0974 0.1061 0.0930 0.1102 0.1441 0.1479 0.1458 0.1365 0.1490 0.1372 0.1271
va: 1.3098 2.2461 1.9668 3.2237 2.9408 3.6040 3.8243 3.7144 3.9274 3.9281 3.9170 3.9031 3.8463 3.9149 4.0341 3.8860 3.5101 3.9695 4.0134 4.2589 3.9154 3.8328 3.9427 4.1243 1.0005 1.0070 1.0005 1.0061 1.0018 1.0002 1.0030 1.0039 1.0037 1.0027 1.0223 1.0038 1.0137 1.0136 1.0041 1.0045 1.0040 1.0230 1.0025 0.9968 1.0056 1.0117 0.9987 1.0035 1.0205
dispcorr: -0.029277846 hartree
energy: -1782.325511039123
dipole: 15.56903 -14.54997 1.01907 41.19896 -40.61270 0.58626 -14.99815 13.37214 -1.62601
magnitude: 2.00651 au
magnitude: 5.10015 debye
