program: Orca
programVersion: 5.0.2
elementType: Cl S O N N C C C C C C C C C C C C C C C C C C C H H H H H H H H H H H H H H H H H H H H H H H H H
charge: 0
multiplicity: 1
keywords: wb97x-d3
keywords: def2-TZVPP
keywords: def2/J RIJCOSX
keywords: DEFGRID2
keywords: scfconv7
keywords: smallprint printgap noloewdin
keywords: NOSOSCF
formula: C19H25ClN2OS
InChI: InChI=1/C19H25ClN2OS/c1-18(2,3)14-9-7-13(8-10-14)12-24-15-11-21-22(19(4,5)6)17(23)16(15)20/h7-11H,12H2,1-6H3
49 atoms
Cl -1.602697 -2.799284 1.979081
S  -0.260292 -3.297724 -0.957361
O  -2.57293 -0.098898 2.280945
N  -1.985524 0.682819 0.20575
N  -1.50715 0.468932 -1.010373
C  2.917974 2.459944 -0.937416
C  -2.391441 2.103116 0.50064
C  2.575996 1.003879 -0.646103
C  4.42732 2.590724 -1.17055
C  2.16707 2.909921 -2.197149
C  2.520398 3.388617 0.208318
C  -2.101843 2.977878 -0.715283
C  -1.563328 2.63952 1.66906
C  -3.89109 2.166323 0.786181
C  2.791929 0.029253 -1.627122
C  2.038626 0.5789 0.56446
C  1.866601 -1.701341 -0.223161
C  2.440182 -1.292778 -1.426073
C  1.690623 -0.751406 0.773622
C  -2.092367 -0.294578 1.173125
C  1.338437 -3.086732 -0.052572
C  -1.035715 -1.800345 -0.45142
C  -1.565684 -1.592767 0.775626
C  -1.060798 -0.693887 -1.339872
H  4.990944 2.295396 -0.283643
H  4.766862 1.973058 -2.003238
H  4.688687 3.625636 -1.40091
H  1.086586 2.817947 -2.066729
H  2.38847 3.956445 -2.415791
H  2.447516 2.327486 -3.075524
H  3.046419 3.153355 1.135105
H  2.768189 4.418736 -0.052376
H  1.447624 3.352736 0.410166
H  -2.668483 2.680611 -1.595864
H  -1.043656 3.001471 -0.974988
H  -2.399836 3.994435 -0.458416
H  -0.495583 2.554218 1.459123
H  -1.77076 2.144888 2.613401
H  -1.789228 3.698262 1.797254
H  -4.464037 1.775493 -0.055555
H  -4.177299 3.20947 0.9222
H  -4.183251 1.627753 1.683172
H  3.231718 0.306251 -2.577509
H  1.862486 1.282519 1.366732
H  2.594553 -2.013466 -2.22064
H  1.257627 -1.04244 1.723638
H  1.990851 -3.840085 -0.495339
H  1.187639 -3.340133 0.995507
H  -0.678774 -0.791446 -2.346514
elementType: Cl S O N C H
totalener: -1782.29519581 hartree
nucrepener: 2553.65718039 hartree
electener: -4335.95237619 hartree
oneelecener: -7518.50497297 hartree
twoeener: 3182.55259677 hartree
cpcmener: -0.02733529 hartree
kineticenergy: 1776.74021532 hartree
xcener: -132.576460957045 hartree
chargesum: -0.0000000
charge: -0.037183 -0.103055 -0.532917 0.148992 -0.258195 0.344618 0.175852 -0.072190 -0.330114 -0.334355 -0.349220 -0.233211 -0.325239 -0.328014 -0.158541 -0.233815 0.045656 -0.233671 -0.137935 0.361619 -0.153515 0.135847 -0.097068 -0.080207 0.101302 0.097686 0.097885 0.096213 0.098512 0.102471 0.102015 0.102999 0.092049 0.102737 0.080155 0.101151 0.088003 0.114309 0.109386 0.107220 0.104030 0.108195 0.143055 0.148378 0.136539 0.141784 0.147709 0.132537 0.129541
qa: -0.0372 -0.1031 -0.5329 0.1490 -0.2582 0.3446 0.1759 -0.0722 -0.3301 -0.3344 -0.3492 -0.2332 -0.3252 -0.3280 -0.1585 -0.2338 0.0457 -0.2337 -0.1379 0.3616 -0.1535 0.1358 -0.0971 -0.0802 0.1013 0.0977 0.0979 0.0962 0.0985 0.1025 0.1020 0.1030 0.0920 0.1027 0.0802 0.1012 0.0880 0.1143 0.1094 0.1072 0.1040 0.1082 0.1431 0.1484 0.1365 0.1418 0.1477 0.1325 0.1295
va: 1.3071 2.2122 1.9697 3.2178 2.9230 3.6042 3.8223 3.6774 3.9145 3.9228 3.9334 3.8618 3.9057 3.9056 3.9472 3.9158 3.5106 4.0142 3.9375 4.2514 3.9276 3.7960 3.9513 4.1253 1.0040 1.0036 1.0031 1.0019 1.0046 1.0051 1.0016 1.0083 0.9978 1.0167 1.0079 1.0061 1.0094 1.0267 1.0033 1.0037 1.0025 1.0227 1.0014 0.9967 1.0103 0.9997 0.9995 1.0065 1.0181
dispcorr: -0.031599369 hartree
energy: -1782.326795174052
dipole: 17.55821 -16.19218 1.36603 44.79140 -43.77135 1.02005 -10.30759 8.84320 -1.46440
magnitude: 2.24744 au
magnitude: 5.71254 debye
