program: Orca
programVersion: 5.0.2
elementType: Cl S O N N C C C C C C C C C C C C C C C C C C C H H H H H H H H H H H H H H H H H H H H H H H H H
charge: 0
multiplicity: 1
keywords: wb97x-d3
keywords: def2-TZVPP
keywords: def2/J RIJCOSX
keywords: DEFGRID2
keywords: scfconv7
keywords: smallprint printgap noloewdin
keywords: NOSOSCF
formula: C19H25ClN2OS
InChI: InChI=1/C19H25ClN2OS/c1-18(2,3)14-9-7-13(8-10-14)12-24-15-11-21-22(19(4,5)6)17(23)16(15)20/h7-11H,12H2,1-6H3
49 atoms
Cl -1.936568 -2.410654 -1.886625
S  -0.074258 -3.411361 0.616788
O  -2.949619 0.262574 -1.472031
N  -2.074856 0.611318 0.619311
N  -1.349163 0.198396 1.646447
C  3.228827 2.379911 0.03807
C  -2.643426 2.001595 0.747352
C  2.753133 0.939978 -0.119185
C  4.136526 2.561165 1.253026
C  4.011673 2.795576 -1.213596
C  2.011405 3.297409 0.204222
C  -2.034296 2.905464 -0.323799
C  -2.278743 2.57485 2.113338
C  -4.168757 1.952953 0.649927
C  1.916333 0.596935 -1.182863
C  3.115448 -0.078532 0.761157
C  1.822686 -1.708321 -0.467989
C  1.459322 -0.699773 -1.356251
C  2.655979 -1.377692 0.593766
C  -2.294702 -0.137038 -0.518944
C  1.261896 -3.0845 -0.614487
C  -0.922812 -1.873121 0.544638
C  -1.679899 -1.45611 -0.497293
C  -0.797011 -0.965844 1.628853
H  4.451276 3.603677 1.321062
H  3.630105 2.312726 2.187309
H  5.040534 1.953228 1.185867
H  4.356049 3.827829 -1.120491
H  4.890102 2.163813 -1.357645
H  3.403821 2.733925 -2.117087
H  1.421615 3.01981 1.080506
H  2.332278 4.333346 0.3339
H  1.353294 3.266004 -0.665297
H  -2.317206 2.628414 -1.335663
H  -0.945318 2.910458 -0.255812
H  -2.378985 3.926241 -0.154413
H  -1.204242 2.681065 2.254122
H  -2.682439 1.988104 2.936869
H  -2.718519 3.570386 2.171921
H  -4.559988 2.946722 0.870691
H  -4.586398 1.265826 1.387017
H  -4.532016 1.6711 -0.334023
H  1.607607 1.351997 -1.895445
H  3.765328 0.127702 1.600385
H  0.813759 -0.927878 -2.196279
H  2.948604 -2.140419 1.305915
H  0.877033 -3.260265 -1.617921
H  2.003164 -3.854892 -0.397048
H  -0.210788 -1.229683 2.498985
elementType: Cl S O N C H
totalener: -1782.29585453 hartree
nucrepener: 2532.85661139 hartree
electener: -4315.15246592 hartree
oneelecener: -7477.13435486 hartree
twoeener: 3161.98188894 hartree
cpcmener: -0.02662826 hartree
kineticenergy: 1776.72957645 hartree
xcener: -132.574034566155 hartree
chargesum: 0.0000000
charge: -0.036774 -0.097862 -0.534946 0.150849 -0.255429 0.360537 0.168184 -0.080235 -0.359346 -0.331071 -0.356398 -0.314583 -0.242620 -0.329806 -0.229464 -0.145100 0.054478 -0.187403 -0.209360 0.351346 -0.152523 0.122671 -0.081010 -0.076469 0.100925 0.101887 0.101689 0.098480 0.102013 0.097533 0.100466 0.105771 0.098806 0.109530 0.086004 0.107305 0.097964 0.103419 0.097777 0.104020 0.107563 0.110092 0.144044 0.147522 0.142109 0.136535 0.134542 0.148975 0.127364
qa: -0.0368 -0.0979 -0.5349 0.1508 -0.2554 0.3605 0.1682 -0.0802 -0.3593 -0.3311 -0.3564 -0.3146 -0.2426 -0.3298 -0.2295 -0.1451 0.0545 -0.1874 -0.2094 0.3513 -0.1525 0.1227 -0.0810 -0.0765 0.1009 0.1019 0.1017 0.0985 0.1020 0.0975 0.1005 0.1058 0.0988 0.1095 0.0860 0.1073 0.0980 0.1034 0.0978 0.1040 0.1076 0.1101 0.1440 0.1475 0.1421 0.1365 0.1345 0.1490 0.1274
va: 1.3099 2.2291 1.9682 3.2236 2.9375 3.5902 3.8344 3.7075 3.9287 3.9173 3.9341 3.9139 3.8472 3.9008 4.0214 3.8799 3.5101 3.9615 4.0060 4.2606 3.9199 3.8137 3.9482 4.1303 1.0069 1.0001 1.0005 1.0031 1.0036 1.0035 1.0001 1.0068 0.9962 1.0239 1.0060 1.0045 1.0136 1.0137 1.0041 1.0025 1.0039 1.0220 1.0024 0.9969 1.0046 1.0118 1.0042 0.9986 1.0211
dispcorr: -0.030105526 hartree
energy: -1782.325960058953
dipole: 18.89925 -17.37245 1.52680 42.32008 -41.61200 0.70808 9.97618 -8.73475 1.24143
magnitude: 2.09133 au
magnitude: 5.31574 debye
