program: Orca
programVersion: 5.0.2
elementType: Cl S O N N C C C C C C C C C C C C C C C C C C C H H H H H H H H H H H H H H H H H H H H H H H H H
charge: 0
multiplicity: 1
keywords: wb97x-d3
keywords: def2-TZVPP
keywords: def2/J RIJCOSX
keywords: DEFGRID2
keywords: scfconv7
keywords: smallprint printgap noloewdin
keywords: NOSOSCF
formula: C19H25ClN2OS
InChI: InChI=1/C19H25ClN2OS/c1-18(2,3)14-9-7-13(8-10-14)12-24-15-11-21-22(19(4,5)6)17(23)16(15)20/h7-11H,12H2,1-6H3
49 atoms
Cl -1.399337 -2.493146 2.274344
S  -0.250272 -3.228995 -0.713917
O  -2.675438 0.090885 2.322181
N  -2.512118 0.569929 0.085034
N  -2.080999 0.261501 -1.126499
C  3.690442 2.254652 -1.016334
C  -3.236097 1.887381 0.201909
C  3.044879 0.916865 -0.673419
C  3.100732 2.786087 -2.328217
C  3.463912 3.303072 0.070991
C  5.201326 2.053258 -1.187027
C  -4.642265 1.664126 0.760401
C  -3.37925 2.515259 -1.18073
C  -2.419331 2.838781 1.075441
C  3.145553 -0.152455 -1.571123
C  2.357666 0.687515 0.51392
C  1.917244 -1.611826 -0.092279
C  2.591089 -1.387747 -1.291934
C  1.803032 -0.556079 0.801082
C  -2.303962 -0.21819 1.198615
C  1.311399 -2.942133 0.211959
C  -1.140465 -1.770811 -0.305316
C  -1.603295 -1.463948 0.929841
C  -1.425295 -0.829546 -1.32865
H  3.272684 2.105445 -3.163129
H  2.024161 2.945363 -2.243348
H  3.559528 3.742623 -2.587291
H  3.942823 4.240075 -0.218057
H  2.403955 3.513332 0.225933
H  3.89195 3.003141 1.029189
H  5.432252 1.343573 -1.98266
H  5.684602 2.998949 -1.441558
H  5.658197 1.68348 -0.267156
H  -5.185412 2.608321 0.714832
H  -4.653066 1.331751 1.793958
H  -5.191722 0.940548 0.156723
H  -3.91321 3.456664 -1.050788
H  -3.961462 1.898616 -1.864127
H  -2.421776 2.741247 -1.64634
H  -2.306601 2.495783 2.100341
H  -2.924047 3.804933 1.106995
H  -1.426561 2.999487 0.652426
H  3.674262 -0.023399 -2.507771
H  2.246848 1.475227 1.246635
H  2.688131 -2.19231 -2.011569
H  1.288239 -0.699935 1.743826
H  1.951413 -3.761564 -0.119461
H  1.133816 -3.074659 1.277563
H  -1.092099 -1.005168 -2.342235
elementType: Cl S O N C H
totalener: -1782.29704178 hartree
nucrepener: 2470.97979459 hartree
electener: -4253.27683638 hartree
oneelecener: -7353.39003730 hartree
twoeener: 3100.11320092 hartree
cpcmener: -0.02664087 hartree
kineticenergy: 1776.73415160 hartree
xcener: -132.573581510572 hartree
chargesum: -0.0000000
charge: -0.039444 -0.091431 -0.536112 0.142944 -0.264212 0.339258 0.176758 -0.091530 -0.330322 -0.361856 -0.328715 -0.325563 -0.248819 -0.330806 -0.171774 -0.184331 0.045940 -0.226053 -0.162342 0.371647 -0.164979 0.091942 -0.092298 -0.047788 0.097795 0.101658 0.097655 0.101313 0.102903 0.101077 0.097490 0.097529 0.101939 0.103072 0.109177 0.107383 0.097856 0.102293 0.101743 0.109458 0.104689 0.107366 0.144654 0.145569 0.139023 0.141910 0.150071 0.140016 0.126246
qa: -0.0394 -0.0914 -0.5361 0.1429 -0.2642 0.3393 0.1768 -0.0915 -0.3303 -0.3619 -0.3287 -0.3256 -0.2488 -0.3308 -0.1718 -0.1843 0.0459 -0.2261 -0.1623 0.3716 -0.1650 0.0919 -0.0923 -0.0478 0.0978 0.1017 0.0977 0.1013 0.1029 0.1011 0.0975 0.0975 0.1019 0.1031 0.1092 0.1074 0.0979 0.1023 0.1017 0.1095 0.1047 0.1074 0.1447 0.1456 0.1390 0.1419 0.1501 0.1400 0.1262
va: 1.3055 2.2410 1.9641 3.2279 2.9468 3.6144 3.8272 3.7224 3.9179 3.9293 3.9155 3.8966 3.8439 3.9145 3.9756 3.9474 3.5178 4.0250 3.9573 4.2479 3.8994 3.8430 3.9103 4.1172 1.0040 1.0040 1.0034 1.0065 1.0005 1.0008 1.0039 1.0036 1.0036 1.0031 1.0226 1.0040 1.0039 1.0133 1.0143 1.0219 1.0027 1.0037 1.0005 0.9997 1.0094 1.0018 0.9989 1.0057 1.0198
dispcorr: -0.027270306 hartree
energy: -1782.324312088034
dipole: 17.28958 -16.18727 1.10231 40.85217 -40.12118 0.73100 -14.07344 12.47532 -1.59812
magnitude: 2.07447 au
magnitude: 5.27288 debye
