program: Orca
programVersion: 5.0.2
elementType: Cl S O N N C C C C C C C C C C C C C C C C C C C H H H H H H H H H H H H H H H H H H H H H H H H H
charge: 0
multiplicity: 1
keywords: wb97x-d3
keywords: def2-TZVPP
keywords: def2/J RIJCOSX
keywords: DEFGRID2
keywords: scfconv7
keywords: smallprint printgap noloewdin
keywords: NOSOSCF
formula: C19H25ClN2OS
InChI: InChI=1/C19H25ClN2OS/c1-18(2,3)14-9-7-13(8-10-14)12-24-15-11-21-22(19(4,5)6)17(23)16(15)20/h7-11H,12H2,1-6H3
49 atoms
Cl -1.373458 -2.688669 2.054596
S  -0.281211 -3.231598 -0.990455
O  -2.526966 -0.058593 2.327049
N  -2.335315 0.601735 0.13825
N  -1.919834 0.376749 -1.096337
C  3.435589 2.356822 -0.791435
C  -2.986483 1.938843 0.370034
C  2.883993 0.952824 -0.578283
C  3.220182 3.254552 0.425362
C  4.941896 2.267071 -1.0651
C  2.736477 3.001829 -1.994122
C  -2.120448 2.770876 1.316122
C  -4.401902 1.74487 0.916946
C  -3.097612 2.687748 -0.954736
C  2.968932 0.009455 -1.608707
C  2.296284 0.542582 0.613823
C  1.893596 -1.676998 -0.258231
C  2.480144 -1.275151 -1.457474
C  1.80808 -0.750733 0.771833
C  -2.171167 -0.290198 1.179852
C  1.321902 -3.047074 -0.101766
C  -1.100139 -1.769865 -0.460074
C  -1.541455 -1.5443 0.800142
C  -1.329474 -0.729306 -1.396845
H  3.625264 4.247547 0.223223
H  2.161735 3.376612 0.664275
H  3.725288 2.872753 1.314438
H  5.36144 3.263425 -1.219575
H  5.469653 1.810689 -0.225432
H  5.161795 1.677857 -1.956702
H  3.114187 4.013909 -2.154586
H  2.902697 2.442606 -2.915821
H  1.658184 3.070687 -1.835641
H  -1.113522 2.896171 0.914442
H  -2.043755 2.349277 2.31499
H  -2.562487 3.763053 1.41242
H  -4.896325 2.716121 0.946102
H  -4.428157 1.336132 1.922651
H  -4.988667 1.098124 0.263201
H  -3.70948 2.160139 -1.685466
H  -2.129289 2.902918 -1.403559
H  -3.583143 3.640806 -0.744894
H  3.427299 0.27937 -2.552561
H  2.206818 1.226462 1.446817
H  2.555727 -1.976034 -2.280691
H  1.361915 -1.035449 1.717737
H  1.953625 -3.807439 -0.563263
H  1.189821 -3.315148 0.944993
H  -1.008158 -0.834042 -2.42392
elementType: Cl S O N C H
totalener: -1782.29660785 hartree
nucrepener: 2497.07968700 hartree
electener: -4279.37629484 hartree
oneelecener: -7405.59874541 hartree
twoeener: 3126.22245056 hartree
cpcmener: -0.02654504 hartree
kineticenergy: 1776.72945232 hartree
xcener: -132.572932755229 hartree
chargesum: -0.0000000
charge: -0.038555 -0.094903 -0.534744 0.145279 -0.260254 0.340459 0.173860 -0.088589 -0.357751 -0.329184 -0.331068 -0.329859 -0.325934 -0.247974 -0.167583 -0.194006 0.047098 -0.231262 -0.157589 0.365898 -0.159241 0.109722 -0.093580 -0.059494 0.100912 0.100945 0.100512 0.097893 0.102053 0.096902 0.097752 0.097364 0.101523 0.104855 0.109123 0.105282 0.103094 0.109171 0.107442 0.103412 0.101410 0.098001 0.144945 0.145482 0.137812 0.140994 0.149664 0.136882 0.125832
qa: -0.0386 -0.0949 -0.5347 0.1453 -0.2603 0.3405 0.1739 -0.0886 -0.3578 -0.3292 -0.3311 -0.3299 -0.3259 -0.2480 -0.1676 -0.1940 0.0471 -0.2313 -0.1576 0.3659 -0.1592 0.1097 -0.0936 -0.0595 0.1009 0.1009 0.1005 0.0979 0.1021 0.0969 0.0978 0.0974 0.1015 0.1049 0.1091 0.1053 0.1031 0.1092 0.1074 0.1034 0.1014 0.0980 0.1449 0.1455 0.1378 0.1410 0.1497 0.1369 0.1258
va: 1.3065 2.2349 1.9670 3.2288 2.9416 3.6107 3.8305 3.7213 3.9305 3.9151 3.9213 3.9180 3.8960 3.8465 3.9670 3.9485 3.5150 4.0191 3.9550 4.2498 3.9115 3.8263 3.9299 4.1199 1.0068 1.0006 1.0009 1.0033 1.0036 1.0043 1.0035 1.0043 1.0037 1.0029 1.0216 1.0032 1.0031 1.0226 1.0040 1.0129 1.0132 1.0039 1.0003 0.9996 1.0104 1.0037 0.9990 1.0046 1.0208
dispcorr: -0.028242101 hartree
energy: -1782.324849949045
dipole: 16.68780 -15.58465 1.10315 42.62447 -41.75037 0.87410 -10.43138 8.87013 -1.56125
magnitude: 2.10202 au
magnitude: 5.34291 debye
