program: Orca
programVersion: 5.0.2
elementType: Cl S O N N C C C C C C C C C C C C C C C C C C C H H H H H H H H H H H H H H H H H H H H H H H H H
charge: 0
multiplicity: 1
keywords: wb97x-d3
keywords: def2-TZVPP
keywords: def2/J RIJCOSX
keywords: DEFGRID2
keywords: scfconv7
keywords: smallprint printgap noloewdin
keywords: NOSOSCF
formula: C19H25ClN2OS
InChI: InChI=1/C19H25ClN2OS/c1-18(2,3)14-9-7-13(8-10-14)12-24-15-11-21-22(19(4,5)6)17(23)16(15)20/h7-11H,12H2,1-6H3
49 atoms
Cl -1.970993 -2.808867 -1.501813
S  -0.049386 -3.39167 1.083289
O  -2.897023 -0.078734 -1.554597
N  -1.964058 0.615482 0.422747
N  -1.257409 0.360496 1.511748
C  3.056237 2.37325 -0.127258
C  -2.442403 2.035871 0.278895
C  2.605907 0.918718 -0.184483
C  2.555052 3.182876 -1.321902
C  2.515653 3.018738 1.154248
C  4.588949 2.427642 -0.118106
C  -3.970013 2.06837 0.218333
C  -1.809387 2.664567 -0.962348
C  -2.002481 2.847813 1.49335
C  2.988152 0.031099 0.828202
C  1.819599 0.409667 -1.212473
C  1.800565 -1.793114 -0.213297
C  2.594199 -1.29424 0.818584
C  1.421973 -0.923131 -1.225955
C  -2.242441 -0.322487 -0.550411
C  1.280167 -3.192347 -0.183225
C  -0.912918 -1.88656 0.7927
C  -1.673757 -1.637845 -0.29809
C  -0.754331 -0.810026 1.70391
H  2.907006 4.21247 -1.240051
H  2.921937 2.787968 -2.270922
H  1.464689 3.215323 -1.3691
H  1.423515 2.998567 1.178306
H  2.877534 2.515137 2.051721
H  2.829986 4.062865 1.215386
H  4.931413 3.463758 -0.077736
H  5.01358 1.909412 0.74258
H  5.00526 1.974168 -1.019612
H  -4.405021 1.585678 1.09438
H  -4.378451 1.601358 -0.67273
H  -4.294843 3.108931 0.2209
H  -2.114446 3.709692 -1.017868
H  -2.109071 2.187402 -1.891193
H  -0.719991 2.643081 -0.897451
H  -0.919355 2.898734 1.597236
H  -2.423958 2.475055 2.425564
H  -2.367456 3.864752 1.349236
H  3.603801 0.380802 1.648064
H  1.495548 1.045742 -2.024848
H  2.895806 -1.946764 1.629615
H  0.803738 -1.282382 -2.04048
H  0.897921 -3.500552 -1.154856
H  2.041165 -3.910916 0.123623
H  -0.179195 -0.939643 2.610153
elementType: Cl S O N C H
totalener: -1782.29553130 hartree
nucrepener: 2555.57141899 hartree
electener: -4337.86695029 hartree
oneelecener: -7522.48815692 hartree
twoeener: 3184.62120663 hartree
cpcmener: -0.02704553 hartree
kineticenergy: 1776.74331747 hartree
xcener: -132.577676314179 hartree
chargesum: -0.0000000
charge: -0.036037 -0.100521 -0.533654 0.153509 -0.256010 0.349947 0.169161 -0.077592 -0.367719 -0.318108 -0.333433 -0.332274 -0.297954 -0.240306 -0.156867 -0.222361 0.055852 -0.244250 -0.150356 0.358777 -0.150362 0.131894 -0.094786 -0.083483 0.102332 0.102920 0.110520 0.082818 0.099453 0.099271 0.097261 0.096835 0.101851 0.107425 0.109751 0.103001 0.108839 0.112439 0.061041 0.097515 0.104354 0.098555 0.143908 0.146374 0.136947 0.142252 0.132474 0.148709 0.130091
qa: -0.0360 -0.1005 -0.5337 0.1535 -0.2560 0.3499 0.1692 -0.0776 -0.3677 -0.3181 -0.3334 -0.3323 -0.2980 -0.2403 -0.1569 -0.2224 0.0559 -0.2442 -0.1504 0.3588 -0.1504 0.1319 -0.0948 -0.0835 0.1023 0.1029 0.1105 0.0828 0.0995 0.0993 0.0973 0.0968 0.1019 0.1074 0.1098 0.1030 0.1088 0.1124 0.0610 0.0975 0.1044 0.0986 0.1439 0.1464 0.1369 0.1423 0.1325 0.1487 0.1301
va: 1.3101 2.2207 1.9677 3.2188 2.9312 3.6004 3.8360 3.6911 3.9365 3.9391 3.9174 3.9052 3.9072 3.8425 3.9488 3.9205 3.5015 4.0119 3.9502 4.2493 3.9217 3.8072 3.9640 4.1331 1.0072 1.0009 0.9857 0.9962 1.0045 1.0055 1.0033 1.0042 1.0033 1.0037 1.0223 1.0029 1.0062 1.0245 1.0142 1.0108 1.0155 1.0045 1.0008 0.9981 1.0116 1.0036 1.0057 0.9990 1.0190
dispcorr: -0.031356339 hartree
energy: -1782.326887634515
dipole: 19.23560 -17.64957 1.58604 44.39278 -43.45873 0.93405 4.24911 -3.09081 1.15830
magnitude: 2.17477 au
magnitude: 5.52782 debye
