program: Orca
programVersion: 5.0.2
elementType: Cl S O N N C C C C C C C C C C C C C C C C C C C H H H H H H H H H H H H H H H H H H H H H H H H H
charge: 0
multiplicity: 1
keywords: wb97x-d3
keywords: def2-TZVPP
keywords: def2/J RIJCOSX
keywords: DEFGRID2
keywords: scfconv7
keywords: smallprint printgap noloewdin
keywords: NOSOSCF
formula: C19H25ClN2OS
InChI: InChI=1/C19H25ClN2OS/c1-18(2,3)14-9-7-13(8-10-14)12-24-15-11-21-22(19(4,5)6)17(23)16(15)20/h7-11H,12H2,1-6H3
49 atoms
Cl -2.615332 -2.269892 -1.877416
S  -0.093315 -3.146902 -0.228265
O  -3.830368 0.169416 -0.894777
N  -2.402556 0.541208 0.864391
N  -1.383346 0.155486 1.611727
C  4.036704 2.287264 -0.664382
C  -3.067167 1.825867 1.280907
C  3.395625 0.93183 -0.390362
C  5.526046 2.227474 -0.304334
C  3.91016 2.704189 -2.128608
C  3.348354 3.351902 0.199534
C  -4.515517 1.552239 1.685874
C  -2.97842 2.844621 0.144215
C  -2.338233 2.407724 2.488517
C  2.787956 0.162688 -1.380291
C  3.388143 0.417795 0.907754
C  2.162892 -1.544436 0.210569
C  2.182474 -1.053185 -1.088043
C  2.781078 -0.790891 1.204511
C  -2.864608 -0.174203 -0.224154
C  1.514315 -2.85043 0.572508
C  -1.010412 -1.730898 0.203168
C  -2.096507 -1.361786 -0.523786
C  -0.714809 -0.908176 1.325633
H  5.683404 1.974916 0.745129
H  6.050239 1.485461 -0.909227
H  5.998575 3.195721 -0.48269
H  4.375174 3.680714 -2.273001
H  4.408622 2.004408 -2.801712
H  2.868285 2.790746 -2.442485
H  2.282867 3.418031 -0.028448
H  3.448876 3.143718 1.265436
H  3.790196 4.333228 0.015237
H  -4.950242 2.472338 2.076889
H  -4.562428 0.803041 2.4775
H  -5.139288 1.221147 0.860126
H  -3.544368 2.558895 -0.737939
H  -1.941103 3.013761 -0.148347
H  -3.379509 3.795283 0.496992
H  -1.297637 2.648856 2.27526
H  -2.371247 1.754126 3.35853
H  -2.844736 3.336063 2.753258
H  2.768103 0.505054 -2.405899
H  3.851884 0.972142 1.71448
H  1.709021 -1.609636 -1.888007
H  2.778575 -1.149129 2.227398
H  2.111395 -3.69777 0.226206
H  1.423998 -2.958019 1.653263
H  0.081586 -1.1506 2.01301
elementType: Cl S O N C H
totalener: -1782.29987059 hartree
nucrepener: 2432.93433456 hartree
electener: -4215.23420516 hartree
oneelecener: -7277.22789643 hartree
twoeener: 3061.99369128 hartree
cpcmener: -0.03140232 hartree
kineticenergy: 1776.72756824 hartree
xcener: -132.579926216266 hartree
chargesum: 0.0000000
charge: -0.054885 -0.060826 -0.547885 0.133025 -0.260372 0.337705 0.178410 -0.111033 -0.328260 -0.359362 -0.332143 -0.329170 -0.329014 -0.244903 -0.160125 -0.170669 -0.041820 -0.170777 -0.210454 0.354416 -0.059557 0.082414 -0.079095 -0.057648 0.097852 0.101429 0.097560 0.100857 0.100800 0.102099 0.103474 0.097501 0.097323 0.102957 0.106783 0.108429 0.109137 0.108052 0.102576 0.101024 0.099402 0.097766 0.148037 0.144106 0.128094 0.145013 0.147863 0.130817 0.143078
qa: -0.0549 -0.0608 -0.5479 0.1330 -0.2604 0.3377 0.1784 -0.1110 -0.3283 -0.3594 -0.3321 -0.3292 -0.3290 -0.2449 -0.1601 -0.1707 -0.0418 -0.1708 -0.2105 0.3544 -0.0596 0.0824 -0.0791 -0.0576 0.0979 0.1014 0.0976 0.1009 0.1008 0.1021 0.1035 0.0975 0.0973 0.1030 0.1068 0.1084 0.1091 0.1081 0.1026 0.1010 0.0994 0.0978 0.1480 0.1441 0.1281 0.1450 0.1479 0.1308 0.1431
va: 1.2977 2.3812 1.9523 3.2181 2.9489 3.6167 3.8312 3.7421 3.9169 3.9282 3.9193 3.9045 3.9009 3.8413 3.9263 3.9749 3.6213 3.9683 3.9698 4.2756 3.8726 3.8128 3.9106 4.0911 1.0039 1.0036 1.0032 1.0066 1.0004 1.0008 1.0030 1.0041 1.0036 1.0029 1.0036 1.0227 1.0231 1.0044 1.0031 1.0141 1.0152 1.0038 0.9975 1.0011 1.0253 1.0038 0.9941 1.0095 0.9996
dispcorr: -0.025651889 hartree
energy: -1782.325522483846
dipole: 25.61842 -23.09234 2.52608 39.68762 -39.25725 0.43037 12.01494 -10.11610 1.89884
magnitude: 3.18934 au
magnitude: 8.10666 debye
