program: Orca
programVersion: 5.0.2
elementType: Cl S O N N C C C C C C C C C C C C C C C C C C C H H H H H H H H H H H H H H H H H H H H H H H H H
charge: 0
multiplicity: 1
keywords: wb97x-d3
keywords: def2-TZVPP
keywords: def2/J RIJCOSX
keywords: DEFGRID2
keywords: scfconv7
keywords: smallprint printgap noloewdin
keywords: NOSOSCF
formula: C19H25ClN2OS
InChI: InChI=1/C19H25ClN2OS/c1-18(2,3)14-9-7-13(8-10-14)12-24-15-11-21-22(19(4,5)6)17(23)16(15)20/h7-11H,12H2,1-6H3
49 atoms
Cl -2.590314 -2.79089 -1.620371
S  0.083908 -2.726703 -0.041578
O  -4.334791 -0.543757 -1.040448
N  -2.965433 0.528144 0.459228
N  -1.844493 0.569757 1.153908
C  4.932818 2.17018 -0.458942
C  -3.92798 1.659118 0.703851
C  4.007331 1.031834 -0.044887
C  6.260218 1.588774 -0.959824
C  4.272591 2.973444 -1.586066
C  5.232794 3.12148 0.697968
C  -3.309358 2.652204 1.683426
C  -5.21188 1.110874 1.326746
C  -4.206038 2.400956 -0.60382
C  3.504969 0.897317 1.24528
C  3.625843 0.064434 -0.980561
C  2.293128 -1.110793 0.652812
C  2.662797 -0.154375 1.587908
C  2.788502 -0.984742 -0.643234
C  -3.280503 -0.494652 -0.418146
C  1.446723 -2.277417 1.074616
C  -1.092697 -1.462236 0.162139
C  -2.257631 -1.505559 -0.538939
C  -0.94921 -0.350826 1.037202
H  6.760443 1.012855 -0.178935
H  6.12273 0.93447 -1.821681
H  6.934633 2.392303 -1.263484
H  3.322335 3.401974 -1.262282
H  4.920131 3.796588 -1.895627
H  4.079081 2.360556 -2.467475
H  5.893656 3.918728 0.35428
H  4.329324 3.593656 1.088097
H  5.734887 2.617414 1.525805
H  -4.030964 3.456555 1.825913
H  -2.390073 3.09788 1.305465
H  -3.106718 2.214865 2.659584
H  -5.855443 1.947219 1.600673
H  -4.995689 0.550737 2.2376
H  -5.776152 0.471048 0.653742
H  -4.750355 1.805793 -1.331145
H  -3.279061 2.747797 -1.062416
H  -4.811495 3.280213 -0.382084
H  3.761545 1.613607 2.013426
H  3.991358 0.123574 -1.998699
H  2.293094 -0.227043 2.604376
H  2.519274 -1.711321 -1.400702
H  2.042593 -3.193712 1.081953
H  1.069705 -2.153404 2.090115
H  -0.076279 -0.219944 1.657789
elementType: Cl S O N C H
totalener: -1782.30099382 hartree
nucrepener: 2364.87571187 hartree
electener: -4147.17670568 hartree
oneelecener: -7140.92815040 hartree
twoeener: 2993.75144471 hartree
cpcmener: -0.03152491 hartree
kineticenergy: 1776.71144961 hartree
xcener: -132.577398552128 hartree
chargesum: -0.0000000
charge: -0.058223 -0.051601 -0.548825 0.132709 -0.262972 0.336273 0.175683 -0.114244 -0.329477 -0.328499 -0.359242 -0.247496 -0.328279 -0.326325 -0.149362 -0.181469 -0.041248 -0.176960 -0.205751 0.351784 -0.059791 0.079473 -0.081455 -0.050038 0.101892 0.097348 0.097580 0.102283 0.097298 0.097212 0.100674 0.101237 0.101248 0.097434 0.102606 0.100516 0.102955 0.107355 0.107540 0.109041 0.107688 0.102377 0.148099 0.144232 0.146502 0.130726 0.152724 0.136403 0.132367
qa: -0.0582 -0.0516 -0.5488 0.1327 -0.2630 0.3363 0.1757 -0.1142 -0.3295 -0.3285 -0.3592 -0.2475 -0.3283 -0.3263 -0.1494 -0.1815 -0.0412 -0.1770 -0.2058 0.3518 -0.0598 0.0795 -0.0815 -0.0500 0.1019 0.0973 0.0976 0.1023 0.0973 0.0972 0.1007 0.1012 0.1012 0.0974 0.1026 0.1005 0.1030 0.1074 0.1075 0.1090 0.1077 0.1024 0.1481 0.1442 0.1465 0.1307 0.1527 0.1364 0.1324
va: 1.2958 2.4026 1.9526 3.2233 2.9707 3.6221 3.8339 3.7558 3.9180 3.9171 3.9275 3.8417 3.9072 3.8967 3.8921 4.0137 3.6314 3.9569 4.0059 4.2757 3.8398 3.8403 3.8699 4.0766 1.0033 1.0040 1.0033 1.0035 1.0036 1.0042 1.0068 1.0006 1.0006 1.0042 1.0133 1.0142 1.0029 1.0038 1.0224 1.0231 1.0041 1.0030 0.9969 1.0018 1.0030 1.0199 0.9919 1.0098 1.0142
dispcorr: -0.024380252 hartree
energy: -1782.325374068807
dipole: 26.51518 -23.99971 2.51546 39.64745 -38.55731 1.09014 9.20114 -7.34889 1.85225
magnitude: 3.30859 au
magnitude: 8.40977 debye
