program: Orca
programVersion: 5.0.2
elementType: Cl S O N N C C C C C C C C C C C C C C C C C C C H H H H H H H H H H H H H H H H H H H H H H H H H
charge: 0
multiplicity: 1
keywords: wb97x-d3
keywords: def2-TZVPP
keywords: def2/J RIJCOSX
keywords: DEFGRID2
keywords: scfconv7
keywords: smallprint printgap noloewdin
keywords: NOSOSCF
formula: C19H25ClN2OS
InChI: InChI=1/C19H25ClN2OS/c1-18(2,3)14-9-7-13(8-10-14)12-24-15-11-21-22(19(4,5)6)17(23)16(15)20/h7-11H,12H2,1-6H3
49 atoms
Cl -2.453035 -2.191005 -2.187814
S  -0.062531 -3.047755 -0.369726
O  -3.847427 0.163091 -1.223152
N  -2.559276 0.541181 0.640037
N  -1.578099 0.174901 1.444288
C  4.280302 2.229546 -0.207479
C  -3.312002 1.779678 1.047624
C  3.563485 0.906484 0.031597
C  5.47817 2.005383 -1.13772
C  3.304404 3.213956 -0.863719
C  4.791546 2.851521 1.090589
C  -2.683007 2.364963 2.30801
C  -4.764127 1.421346 1.361784
C  -3.215374 2.833876 -0.055647
C  3.051403 0.183918 -1.050728
C  3.36435 0.372586 1.300593
C  2.160567 -1.523646 0.40244
C  2.365089 -1.005018 -0.874079
C  2.671944 -0.818694 1.482853
C  -2.914336 -0.160122 -0.497712
C  1.431132 -2.81476 0.641442
C  -1.03882 -1.662516 0.025986
C  -2.077038 -1.304396 -0.77389
C  -0.850968 -0.856713 1.182868
H  6.197938 1.312657 -0.697698
H  5.178679 1.603841 -2.106707
H  5.995487 2.949304 -1.321945
H  3.793321 4.174701 -1.038201
H  2.942164 2.850626 -1.826602
H  2.436042 3.393439 -0.227138
H  5.300947 3.791178 0.871188
H  3.982587 3.076566 1.787961
H  5.507258 2.204839 1.601509
H  -3.247301 3.262118 2.562728
H  -1.644824 2.659871 2.161753
H  -2.735492 1.690158 3.160523
H  -5.268495 2.307834 1.746961
H  -4.816558 0.651734 2.133141
H  -5.321116 1.079981 0.493735
H  -2.174562 3.054128 -0.29638
H  -3.671351 3.756066 0.305358
H  -3.730237 2.552625 -0.969643
H  3.181409 0.557569 -2.059191
H  3.736451 0.88333 2.177989
H  1.977003 -1.525194 -1.74159
H  2.522986 -1.196789 2.487669
H  2.045082 -3.671336 0.351218
H  1.197619 -2.94845 1.697754
H  -0.090958 -1.080076 1.916099
elementType: Cl S O N C H
totalener: -1782.30027209 hartree
nucrepener: 2418.64465426 hartree
electener: -4200.94492635 hartree
oneelecener: -7248.61771763 hartree
twoeener: 3047.67279127 hartree
cpcmener: -0.03137826 hartree
kineticenergy: 1776.73111891 hartree
xcener: -132.581064603137 hartree
chargesum: -0.0000000
charge: -0.055835 -0.057883 -0.549399 0.134057 -0.262300 0.334360 0.179629 -0.106305 -0.329057 -0.329442 -0.359045 -0.246781 -0.330838 -0.329190 -0.180434 -0.157508 -0.050475 -0.200048 -0.174844 0.353152 -0.058786 0.083363 -0.080260 -0.054171 0.101875 0.097187 0.097559 0.097263 0.097035 0.103179 0.100962 0.100617 0.102276 0.097606 0.102356 0.099627 0.103367 0.106915 0.108493 0.108270 0.102841 0.109499 0.144895 0.148366 0.131065 0.145129 0.149461 0.130973 0.141224
qa: -0.0558 -0.0579 -0.5494 0.1341 -0.2623 0.3344 0.1796 -0.1063 -0.3291 -0.3294 -0.3590 -0.2468 -0.3308 -0.3292 -0.1804 -0.1575 -0.0505 -0.2000 -0.1748 0.3532 -0.0588 0.0834 -0.0803 -0.0542 0.1019 0.0972 0.0976 0.0973 0.0970 0.1032 0.1010 0.1006 0.1023 0.0976 0.1024 0.0996 0.1034 0.1069 0.1085 0.1083 0.1028 0.1095 0.1449 0.1484 0.1311 0.1451 0.1495 0.1310 0.1412
va: 1.2974 2.3893 1.9511 3.2195 2.9536 3.6243 3.8295 3.7414 3.9179 3.9178 3.9269 3.8413 3.9064 3.8986 4.0112 3.8994 3.6257 3.9768 3.9592 4.2741 3.8661 3.8136 3.9020 4.0886 1.0033 1.0045 1.0033 1.0037 1.0041 1.0036 1.0067 1.0006 1.0005 1.0040 1.0136 1.0149 1.0028 1.0036 1.0224 1.0042 1.0031 1.0230 1.0016 0.9971 1.0232 1.0042 0.9930 1.0097 1.0025
dispcorr: -0.025311043 hartree
energy: -1782.325583134327
dipole: 24.91993 -22.55710 2.36283 38.40166 -38.01218 0.38947 15.38643 -13.30462 2.08181
magnitude: 3.17310 au
magnitude: 8.06538 debye
