program: Orca
programVersion: 5.0.2
elementType: Cl S O N N C C C C C C C C C C C C C C C C C C C H H H H H H H H H H H H H H H H H H H H H H H H H
charge: 0
multiplicity: 1
keywords: wb97x-d3
keywords: def2-TZVPP
keywords: def2/J RIJCOSX
keywords: DEFGRID2
keywords: scfconv7
keywords: smallprint printgap noloewdin
keywords: NOSOSCF
formula: C19H25ClN2OS
InChI: InChI=1/C19H25ClN2OS/c1-18(2,3)14-9-7-13(8-10-14)12-24-15-11-21-22(19(4,5)6)17(23)16(15)20/h7-11H,12H2,1-6H3
49 atoms
Cl -1.607023 -2.250364 2.778608
S  0.00528 -3.138975 0.245294
O  -3.145847 0.178291 2.363407
N  -2.524393 0.567272 0.188555
N  -1.887426 0.18667 -0.905286
C  3.954947 2.268952 -1.019972
C  -3.312581 1.845512 0.07173
C  3.265551 0.909448 -1.021625
C  4.513993 2.633926 0.35367
C  5.112425 2.254854 -2.024602
C  2.941367 3.344867 -1.42981
C  -4.801232 1.551492 0.253285
C  -3.112128 2.442203 -1.31818
C  -2.806099 2.863467 1.09372
C  3.153308 0.112299 0.115673
C  2.695589 0.422148 -2.198963
C  1.899103 -1.567529 -1.08396
C  2.482548 -1.103581 0.087689
C  2.024976 -0.788948 -2.230759
C  -2.516493 -0.155146 1.366542
C  1.144903 -2.864986 -1.147998
C  -0.990398 -1.711114 0.225853
C  -1.685766 -1.338955 1.33195
C  -1.166878 -0.881396 -0.916657
H  5.266672 1.920875 0.694477
H  4.991551 3.61374 0.30578
H  3.732809 2.689507 1.113781
H  5.617914 3.222639 -2.032138
H  5.8521 1.495274 -1.765756
H  4.770538 2.056266 -3.041212
H  2.537356 3.167646 -2.427215
H  2.102921 3.385741 -0.732079
H  3.415712 4.328335 -1.438897
H  -5.052248 1.20031 1.249845
H  -5.143399 0.812586 -0.472294
H  -5.362921 2.469202 0.077529
H  -2.072561 2.695157 -1.520584
H  -3.689164 3.365965 -1.357552
H  -3.474758 1.793886 -2.113539
H  -2.987964 2.571402 2.123644
H  -3.322929 3.808532 0.925387
H  -1.738349 3.046215 0.965926
H  3.582435 0.433707 1.05476
H  2.758619 0.998945 -3.113418
H  2.40281 -1.680482 1.00117
H  1.578753 -1.127704 -3.158563
H  0.615957 -2.968699 -2.095357
H  1.8198 -3.72135 -1.073157
H  -0.714344 -1.120542 -1.867017
elementType: Cl S O N C H
totalener: -1782.29979976 hartree
nucrepener: 2434.30155267 hartree
electener: -4216.60135243 hartree
oneelecener: -7279.96282756 hartree
twoeener: 3063.36147514 hartree
cpcmener: -0.03143950 hartree
kineticenergy: 1776.73155102 hartree
xcener: -132.580853809310 hartree
chargesum: 0.0000000
charge: -0.055248 -0.058935 -0.547946 0.132463 -0.260222 0.340013 0.183148 -0.111931 -0.358432 -0.327888 -0.332467 -0.329840 -0.248709 -0.328941 -0.159565 -0.167322 -0.035608 -0.175265 -0.217322 0.355142 -0.061235 0.082068 -0.082552 -0.056711 0.101470 0.100216 0.101317 0.097258 0.101311 0.096809 0.098099 0.103104 0.097572 0.107887 0.106943 0.102390 0.101793 0.097655 0.100253 0.109402 0.102627 0.107977 0.148065 0.144719 0.128852 0.146264 0.130240 0.148611 0.142472
qa: -0.0552 -0.0589 -0.5479 0.1325 -0.2602 0.3400 0.1831 -0.1119 -0.3584 -0.3279 -0.3325 -0.3298 -0.2487 -0.3289 -0.1596 -0.1673 -0.0356 -0.1753 -0.2173 0.3551 -0.0612 0.0821 -0.0826 -0.0567 0.1015 0.1002 0.1013 0.0973 0.1013 0.0968 0.0981 0.1031 0.0976 0.1079 0.1069 0.1024 0.1018 0.0977 0.1003 0.1094 0.1026 0.1080 0.1481 0.1447 0.1289 0.1463 0.1302 0.1486 0.1425
va: 1.2969 2.3833 1.9522 3.2213 2.9531 3.6159 3.8234 3.7448 3.9272 3.9175 3.9199 3.9070 3.8439 3.8993 3.9234 3.9702 3.6117 3.9731 3.9708 4.2737 3.8719 3.8134 3.9060 4.0916 1.0005 1.0068 1.0006 1.0033 1.0036 1.0044 1.0039 1.0033 1.0034 1.0230 1.0037 1.0030 1.0135 1.0040 1.0148 1.0229 1.0030 1.0044 0.9973 1.0008 1.0244 1.0035 1.0101 0.9944 1.0006
dispcorr: -0.025674533 hartree
energy: -1782.325474292394
dipole: 18.34663 -16.80548 1.54115 39.51742 -39.08499 0.43244 -21.32416 18.57353 -2.75064
magnitude: 3.18248 au
magnitude: 8.08921 debye
