program: Orca
programVersion: 5.0.2
elementType: Cl S O N N C C C C C C C C C C C C C C C C C C C H H H H H H H H H H H H H H H H H H H H H H H H H
charge: 0
multiplicity: 1
keywords: wb97x-d3
keywords: def2-TZVPP
keywords: def2/J RIJCOSX
keywords: DEFGRID2
keywords: scfconv7
keywords: smallprint printgap noloewdin
keywords: NOSOSCF
formula: C19H25ClN2OS
InChI: InChI=1/C19H25ClN2OS/c1-18(2,3)14-9-7-13(8-10-14)12-24-15-11-21-22(19(4,5)6)17(23)16(15)20/h7-11H,12H2,1-6H3
49 atoms
Cl -2.124491 -2.356456 2.641106
S  0.090409 -2.781892 0.498587
O  -3.888335 -0.12637 2.05576
N  -2.896675 0.545609 0.098494
N  -1.972957 0.380696 -0.827625
C  4.709292 2.115716 -1.002507
C  -3.854519 1.681251 -0.135834
C  3.805135 0.89007 -0.939047
C  5.817485 1.875428 -2.035239
C  3.877748 3.333475 -1.425108
C  5.363931 2.424187 0.34296
C  -5.267198 1.124989 -0.314377
C  -3.464474 2.415695 -1.415774
C  -3.774477 2.674725 1.023075
C  3.602128 0.152526 0.225166
C  3.128918 0.466953 -2.084666
C  2.08794 -1.35996 -0.894286
C  2.759994 -0.951875 0.249953
C  2.287741 -0.632542 -2.064145
C  -3.018728 -0.271398 1.210089
C  1.205459 -2.576034 -0.920492
C  -1.061178 -1.486615 0.338437
C  -2.023599 -1.318077 1.283656
C  -1.100233 -0.563036 -0.74401
H  6.475938 2.744858 -2.094904
H  6.43087 1.012731 -1.768332
H  5.417476 1.701795 -3.035396
H  3.417617 3.197038 -2.404902
H  3.079347 3.536138 -0.708693
H  4.507461 4.224137 -1.482241
H  5.998819 3.307004 0.248656
H  4.628512 2.637029 1.121136
H  5.997543 1.606405 0.691498
H  -5.938782 1.939926 -0.586501
H  -5.662277 0.661049 0.58542
H  -5.294955 0.391785 -1.122289
H  -4.173196 3.233195 -1.551169
H  -3.518909 1.782467 -2.300287
H  -2.466393 2.849814 -1.364474
H  -2.751668 3.028903 1.162939
H  -4.131025 2.266534 1.964519
H  -4.392236 3.541918 0.786333
H  4.101024 0.429877 1.143895
H  3.249945 1.003359 -3.01788
H  2.62805 -1.490461 1.18091
H  1.77674 -0.927672 -2.973744
H  0.639667 -2.63883 -1.850766
H  1.808692 -3.486744 -0.872153
H  -0.397238 -0.609429 -1.561539
elementType: Cl S O N C H
totalener: -1782.31327137 hartree
nucrepener: 2377.70240013 hartree
electener: -4160.01567151 hartree
oneelecener: -7166.56446589 hartree
twoeener: 3006.54879438 hartree
cpcmener: -0.02554185 hartree
kineticenergy: 1776.71769823 hartree
xcener: -132.577385119909 hartree
chargesum: -0.0000000
charge: -0.055771 -0.049194 -0.513493 0.130182 -0.261098 0.324909 0.175395 -0.106749 -0.326353 -0.325803 -0.355958 -0.327705 -0.242691 -0.325480 -0.163253 -0.162285 -0.043206 -0.163167 -0.212089 0.334805 -0.061888 0.080333 -0.082164 -0.055132 0.096803 0.102169 0.096424 0.096510 0.102611 0.096267 0.099773 0.100759 0.101090 0.100209 0.110605 0.105288 0.095443 0.099030 0.100958 0.105538 0.111607 0.099824 0.144994 0.141264 0.128317 0.143670 0.130996 0.148448 0.129256
qa: -0.0558 -0.0492 -0.5135 0.1302 -0.2611 0.3249 0.1754 -0.1067 -0.3264 -0.3258 -0.3560 -0.3277 -0.2427 -0.3255 -0.1633 -0.1623 -0.0432 -0.1632 -0.2121 0.3348 -0.0619 0.0803 -0.0822 -0.0551 0.0968 0.1022 0.0964 0.0965 0.1026 0.0963 0.0998 0.1008 0.1011 0.1002 0.1106 0.1053 0.0954 0.0990 0.1010 0.1055 0.1116 0.0998 0.1450 0.1413 0.1283 0.1437 0.1310 0.1484 0.1293
va: 1.2985 2.4024 1.9955 3.2112 2.9677 3.6371 3.8404 3.7475 3.9183 3.9175 3.9275 3.9053 3.8412 3.8974 3.9435 3.9820 3.6292 3.9857 3.9729 4.2963 3.8560 3.8265 3.8694 4.0789 1.0035 1.0036 1.0044 1.0044 1.0037 1.0037 1.0070 1.0008 1.0008 1.0034 1.0225 1.0041 1.0042 1.0151 1.0144 1.0046 1.0230 1.0036 0.9986 1.0018 1.0237 1.0034 1.0104 0.9930 1.0155
dispcorr: -0.024593462 hartree
energy: -1782.337864833285
dipole: 22.87638 -20.98691 1.88947 37.30005 -36.68533 0.61471 -22.15458 19.76145 -2.39313
magnitude: 3.11047 au
magnitude: 7.90620 debye
