program: Orca
programVersion: 5.0.2
elementType: Cl S O N N C C C C C C C C C C C C C C C C C C C H H H H H H H H H H H H H H H H H H H H H H H H H
charge: 0
multiplicity: 1
keywords: wb97x-d3
keywords: def2-TZVPP
keywords: def2/J RIJCOSX
keywords: DEFGRID2
keywords: scfconv7
keywords: smallprint printgap noloewdin
keywords: NOSOSCF
formula: C19H25ClN2OS
InChI: InChI=1/C19H25ClN2OS/c1-18(2,3)14-9-7-13(8-10-14)12-24-15-11-21-22(19(4,5)6)17(23)16(15)20/h7-11H,12H2,1-6H3
49 atoms
Cl -2.172358 -2.101295 -2.162654
S  -0.193972 -3.426421 -0.039601
O  -3.163834 0.476861 -1.302541
N  -2.041678 0.597643 0.692723
N  -1.293966 0.025436 1.621808
C  3.305417 2.341447 -0.36932
C  -2.498945 1.997505 1.000357
C  2.874224 0.896188 -0.145496
C  3.145394 2.77522 -1.825731
C  2.444745 3.265262 0.501965
C  4.77836 2.499229 0.028116
C  -4.019092 2.02176 1.153455
C  -2.02148 2.947027 -0.099699
C  -1.8752 2.455424 2.316105
C  2.414451 0.071505 -1.171009
C  2.917075 0.349111 1.137665
C  2.001557 -1.748328 0.362435
C  1.986334 -1.225747 -0.924833
C  2.486416 -0.943051 1.388271
C  -2.415265 -0.028129 -0.481003
C  1.464226 -3.112867 0.677702
C  -0.981281 -1.891174 0.237562
C  -1.811478 -1.335447 -0.678201
C  -0.793853 -1.145238 1.436367
H  3.4588 3.814861 -1.935964
H  3.757147 2.180005 -2.506085
H  2.108129 2.712749 -2.16082
H  2.549605 3.046331 1.565486
H  2.735725 4.307578 0.354185
H  1.386038 3.178382 0.247803
H  5.423382 1.853282 -0.570518
H  5.105819 3.529891 -0.125104
H  4.947054 2.256445 1.078359
H  -4.329586 3.021449 1.459452
H  -4.342352 1.324962 1.928535
H  -4.544828 1.782121 0.233054
H  -2.492281 2.766655 -1.061593
H  -0.938888 2.883635 -0.226506
H  -2.2574 3.970481 0.193776
H  -0.785996 2.462602 2.283645
H  -2.190227 1.853958 3.16704
H  -2.206559 3.478712 2.494217
H  2.366083 0.436495 -2.187815
H  3.27313 0.941908 1.971357
H  1.609458 -1.820538 -1.748903
H  2.508575 -1.32333 2.403048
H  2.074471 -3.903892 0.235404
H  1.446745 -3.286863 1.752955
H  -0.217633 -1.54648 2.258268
elementType: Cl S O N C H
totalener: -1782.30858988 hartree
nucrepener: 2511.54512321 hartree
electener: -4293.85371309 hartree
oneelecener: -7434.49136496 hartree
twoeener: 3140.63765187 hartree
cpcmener: -0.02520636 hartree
kineticenergy: 1776.72774776 hartree
xcener: -132.576917934747 hartree
chargesum: -0.0000000
charge: -0.047466 -0.072369 -0.506845 0.132477 -0.247843 0.340446 0.174591 -0.099377 -0.355251 -0.323404 -0.327980 -0.331427 -0.328566 -0.237928 -0.149151 -0.178313 -0.001860 -0.197085 -0.193902 0.334792 -0.082881 0.098748 -0.075000 -0.096972 0.099696 0.100049 0.101579 0.098162 0.100200 0.086574 0.101294 0.097337 0.096303 0.101032 0.104691 0.111278 0.116341 0.100782 0.102914 0.094146 0.100160 0.096028 0.144923 0.139900 0.128364 0.138561 0.144738 0.125315 0.142200
qa: -0.0475 -0.0724 -0.5068 0.1325 -0.2478 0.3404 0.1746 -0.0994 -0.3553 -0.3234 -0.3280 -0.3314 -0.3286 -0.2379 -0.1492 -0.1783 -0.0019 -0.1971 -0.1939 0.3348 -0.0829 0.0987 -0.0750 -0.0970 0.0997 0.1000 0.1016 0.0982 0.1002 0.0866 0.1013 0.0973 0.0963 0.1010 0.1047 0.1113 0.1163 0.1008 0.1029 0.0941 0.1002 0.0960 0.1449 0.1399 0.1284 0.1386 0.1447 0.1253 0.1422
va: 1.3011 2.3317 2.0025 3.2031 2.9365 3.6205 3.8360 3.7329 3.9296 3.9327 3.9179 3.9057 3.8973 3.8468 3.8994 3.9724 3.5836 3.9888 3.9679 4.2982 3.8996 3.7906 3.9243 4.1356 1.0074 1.0009 1.0003 1.0040 1.0068 1.0008 1.0042 1.0032 1.0039 1.0031 1.0039 1.0221 1.0251 1.0021 1.0037 1.0154 1.0165 1.0043 0.9987 1.0025 1.0217 1.0055 0.9971 1.0103 0.9963
dispcorr: -0.028616782 hartree
energy: -1782.337206666247
dipole: 21.97617 -20.00174 1.97442 40.70823 -40.37875 0.32948 13.34953 -11.44556 1.90397
magnitude: 2.76261 au
magnitude: 7.02200 debye
