program: Orca
programVersion: 5.0.2
elementType: Cl S O N N C C C C C C C C C C C C C C C C C C C H H H H H H H H H H H H H H H H H H H H H H H H H
charge: 0
multiplicity: 1
keywords: wb97x-d3
keywords: def2-TZVPP
keywords: def2/J RIJCOSX
keywords: DEFGRID2
keywords: scfconv7
keywords: smallprint printgap noloewdin
keywords: NOSOSCF
formula: C19H25ClN2OS
InChI: InChI=1/C19H25ClN2OS/c1-18(2,3)14-9-7-13(8-10-14)12-24-15-11-21-22(19(4,5)6)17(23)16(15)20/h7-11H,12H2,1-6H3
49 atoms
Cl -0.674287 -2.277073 2.143249
S  -0.460108 -3.349155 -0.976045
O  -1.780932 0.388145 2.261903
N  -2.316771 0.608554 0.044087
N  -2.29435 0.143631 -1.192341
C  3.160088 2.366177 -0.488997
C  -2.942364 1.965889 0.211452
C  2.68097 0.918819 -0.51021
C  4.64043 2.400562 -0.089787
C  3.008887 3.045763 -1.84882
C  2.341466 3.158109 0.537874
C  -1.875219 2.963405 0.660726
C  -4.104721 1.884976 1.201648
C  -3.50142 2.435443 -1.128545
C  2.213007 0.28792 -1.662662
C  2.70396 0.163133 0.662222
C  1.787595 -1.766864 -0.463569
C  1.775362 -1.02864 -1.641647
C  2.262439 -1.150119 0.688632
C  -1.785811 -0.064119 1.128905
C  1.282302 -3.17451 -0.410163
C  -1.172174 -1.830301 -0.463059
C  -1.234392 -1.3733 0.809876
C  -1.751971 -0.99367 -1.455312
H  5.006536 3.429532 -0.068858
H  4.807514 1.975407 0.901221
H  5.256787 1.843447 -0.798261
H  3.353679 4.079287 -1.784163
H  3.600945 2.556852 -2.624825
H  1.969735 3.071341 -2.183324
H  1.278033 3.151948 0.289655
H  2.446854 2.758752 1.54762
H  2.669191 4.199731 0.564223
H  -1.457367 2.73407 1.637558
H  -2.320014 3.957716 0.718497
H  -1.060102 3.008512 -0.063896
H  -4.615854 2.848206 1.219866
H  -3.793455 1.66105 2.217809
H  -4.831385 1.133667 0.887794
H  -2.734358 2.551945 -1.892329
H  -3.955935 3.413083 -0.965417
H  -4.275017 1.773692 -1.516966
H  2.177167 0.820756 -2.603169
H  3.06667 0.601326 1.584161
H  1.40575 -1.47718 -2.556819
H  2.28791 -1.699335 1.621818
H  1.828404 -3.825681 -1.095917
H  1.384883 -3.59296 0.589283
H  -1.75471 -1.296593 -2.494058
elementType: Cl S O N C H
totalener: -1782.30727875 hartree
nucrepener: 2531.88861792 hartree
electener: -4314.19589667 hartree
oneelecener: -7475.47890042 hartree
twoeener: 3161.28300375 hartree
cpcmener: -0.02226724 hartree
kineticenergy: 1776.74051958 hartree
xcener: -132.576590325683 hartree
chargesum: 0.0000000
charge: -0.044268 -0.084104 -0.503587 0.142293 -0.258059 0.333728 0.176817 -0.091500 -0.326883 -0.355885 -0.325767 -0.349879 -0.324822 -0.239478 -0.149348 -0.185104 0.013135 -0.218410 -0.189230 0.313437 -0.103945 0.089836 -0.040190 -0.060942 0.096332 0.096897 0.101549 0.099645 0.100460 0.101448 0.091587 0.098911 0.098086 0.116132 0.106182 0.107584 0.100484 0.112872 0.105251 0.098684 0.095999 0.101705 0.143688 0.138756 0.137085 0.135769 0.147897 0.123967 0.125184
qa: -0.0443 -0.0841 -0.5036 0.1423 -0.2581 0.3337 0.1768 -0.0915 -0.3269 -0.3559 -0.3258 -0.3499 -0.3248 -0.2395 -0.1493 -0.1851 0.0131 -0.2184 -0.1892 0.3134 -0.1039 0.0898 -0.0402 -0.0609 0.0963 0.0969 0.1015 0.0996 0.1005 0.1014 0.0916 0.0989 0.0981 0.1161 0.1062 0.1076 0.1005 0.1129 0.1053 0.0987 0.0960 0.1017 0.1437 0.1388 0.1371 0.1358 0.1479 0.1240 0.1252
va: 1.3026 2.2770 2.0031 3.2082 2.9413 3.6285 3.8330 3.7231 3.9167 3.9272 3.9324 3.9096 3.8992 3.8387 3.9000 4.0110 3.5654 3.9913 3.9620 4.3068 3.9211 3.8271 3.8942 4.1263 1.0036 1.0042 1.0038 1.0074 1.0007 1.0011 1.0036 1.0051 1.0057 1.0202 1.0054 0.9982 1.0033 1.0224 1.0043 1.0158 1.0041 1.0142 0.9990 1.0040 1.0138 1.0139 0.9987 1.0096 1.0187
dispcorr: -0.029099177 hartree
energy: -1782.336377923612
dipole: 12.24220 -11.65727 0.58493 40.91844 -40.43426 0.48418 -9.67044 8.16910 -1.50134
magnitude: 1.68244 au
magnitude: 4.27641 debye
