program: Orca
programVersion: 5.0.2
elementType: Cl S O N N C C C C C C C C C C C C C C C C C C C H H H H H H H H H H H H H H H H H H H H H H H H H
charge: 0
multiplicity: 1
keywords: wb97x-d3
keywords: def2-TZVPP
keywords: def2/J RIJCOSX
keywords: DEFGRID2
keywords: scfconv7
keywords: smallprint printgap noloewdin
keywords: NOSOSCF
formula: C19H25ClN2OS
InChI: InChI=1/C19H25ClN2OS/c1-18(2,3)14-9-7-13(8-10-14)12-24-15-11-21-22(19(4,5)6)17(23)16(15)20/h7-11H,12H2,1-6H3
49 atoms
Cl 0.252971 -0.787445 2.039738
S  -0.349828 -3.356929 0.101792
O  -1.440158 1.451255 1.406693
N  -2.771103 0.423009 -0.147799
N  -3.068322 -0.632664 -0.889386
C  3.656881 1.898843 0.092696
C  -3.629719 1.636831 -0.378659
C  2.976909 0.606294 -0.344762
C  4.0473 2.725914 -1.137722
C  2.671927 2.701378 0.953063
C  4.915825 1.64133 0.919022
C  -4.305592 2.05283 0.929114
C  -4.723991 1.298253 -1.387237
C  -2.77269 2.7623 -0.959302
C  1.813237 0.662292 -1.113549
C  3.441893 -0.657307 0.015438
C  1.571733 -1.739583 -1.064821
C  1.125441 -0.485034 -1.471609
C  2.749108 -1.808105 -0.331203
C  -1.735892 0.457221 0.76401
C  0.751963 -2.957031 -1.327628
C  -1.284021 -1.864564 0.106788
C  -0.998953 -0.797254 0.888992
C  -2.377946 -1.714509 -0.788109
H  4.532342 3.655611 -0.83201
H  4.746111 2.18319 -1.777203
H  3.181927 2.996443 -1.744625
H  3.127566 3.637483 1.283657
H  1.762073 2.955669 0.406893
H  2.375814 2.142979 1.843273
H  5.363248 2.591966 1.214559
H  4.701944 1.087311 1.835078
H  5.672151 1.088099 0.358904
H  -5.009739 2.858544 0.718782
H  -3.608102 2.416832 1.678393
H  -4.872314 1.223804 1.356187
H  -5.332711 2.19323 -1.518848
H  -5.381564 0.500461 -1.04317
H  -4.329719 1.021051 -2.363697
H  -2.278033 2.440277 -1.877367
H  -2.015675 3.124288 -0.268185
H  -3.417527 3.605264 -1.210788
H  1.417948 1.619043 -1.432875
H  4.349273 -0.763627 0.594521
H  0.22258 -0.40058 -2.066152
H  3.124124 -2.771756 -0.005456
H  0.134888 -2.854432 -2.220092
H  1.36545 -3.851797 -1.445091
H  -2.67762 -2.533891 -1.428534
elementType: Cl S O N C H
totalener: -1782.30711658 hartree
nucrepener: 2530.64393256 hartree
electener: -4312.95104914 hartree
oneelecener: -7473.27203519 hartree
twoeener: 3160.32098605 hartree
cpcmener: -0.02408990 hartree
kineticenergy: 1776.73490429 hartree
xcener: -132.572833241993 hartree
chargesum: -0.0000000
charge: -0.029953 -0.103154 -0.504617 0.139140 -0.265969 0.346886 0.174603 -0.082452 -0.324332 -0.331496 -0.357653 -0.326847 -0.241972 -0.330401 -0.195987 -0.160192 0.035497 -0.214141 -0.186408 0.320976 -0.135540 0.052774 -0.013566 -0.050807 0.096964 0.100953 0.095895 0.097769 0.097044 0.094783 0.099675 0.099773 0.101083 0.100806 0.112356 0.105657 0.095294 0.100922 0.099658 0.105831 0.110585 0.102840 0.138070 0.143287 0.147757 0.133055 0.137968 0.140498 0.127086
qa: -0.0300 -0.1032 -0.5046 0.1391 -0.2660 0.3469 0.1746 -0.0825 -0.3243 -0.3315 -0.3577 -0.3268 -0.2420 -0.3304 -0.1960 -0.1602 0.0355 -0.2141 -0.1864 0.3210 -0.1355 0.0528 -0.0136 -0.0508 0.0970 0.1010 0.0959 0.0978 0.0970 0.0948 0.0997 0.0998 0.1011 0.1008 0.1124 0.1057 0.0953 0.1009 0.0997 0.1058 0.1106 0.1028 0.1381 0.1433 0.1478 0.1331 0.1380 0.1405 0.1271
va: 1.3142 2.1990 1.9956 3.2269 2.9411 3.6035 3.8388 3.6958 3.9156 3.9271 3.9293 3.9001 3.8425 3.9102 3.9850 3.8990 3.5423 3.9372 4.0136 4.2753 3.9174 3.7891 3.9689 4.1371 1.0035 1.0040 1.0047 1.0067 1.0038 1.0098 1.0072 1.0006 1.0008 1.0036 1.0213 1.0044 1.0044 1.0144 1.0152 1.0038 1.0209 1.0039 1.0022 0.9983 0.9933 1.0078 1.0029 0.9990 1.0138
dispcorr: -0.029664799 hartree
energy: -1782.336781374618
dipole: 6.63589 -6.99451 -0.35862 29.94384 -30.32032 -0.37648 -12.40880 10.74705 -1.66175
magnitude: 1.74119 au
magnitude: 4.42576 debye
