program: Orca
programVersion: 5.0.2
elementType: Cl S O N N C C C C C C C C C C C C C C C C C C C H H H H H H H H H H H H H H H H H H H H H H H H H
charge: 0
multiplicity: 1
keywords: wb97x-d3
keywords: def2-TZVPP
keywords: def2/J RIJCOSX
keywords: DEFGRID2
keywords: scfconv7
keywords: smallprint printgap noloewdin
keywords: NOSOSCF
formula: C19H25ClN2OS
InChI: InChI=1/C19H25ClN2OS/c1-18(2,3)14-9-7-13(8-10-14)12-24-15-11-21-22(19(4,5)6)17(23)16(15)20/h7-11H,12H2,1-6H3
49 atoms
Cl 0.247265 -0.061877 -2.209889
S  -0.355876 -3.135825 -1.247268
O  -1.414505 1.834929 -0.825853
N  -2.743679 0.346053 0.297695
N  -3.039501 -0.896432 0.643173
C  3.62355 1.823483 0.556019
C  -3.594848 1.412566 0.931723
C  2.951782 0.455279 0.522028
C  4.88135 1.872855 -0.309843
C  2.632242 2.86943 0.027637
C  4.017167 2.175485 1.994939
C  -2.73237 2.270604 1.857318
C  -4.688994 0.755643 1.769034
C  -4.271157 2.24889 -0.155123
C  3.4135 -0.596969 -0.267067
C  1.801406 0.227623 1.279379
C  1.567486 -2.007212 0.394494
C  2.730823 -1.802309 -0.335934
C  1.123775 -0.978931 1.222127
C  -1.715286 0.683144 -0.559397
C  0.756414 -3.247217 0.224726
C  -1.27751 -1.725789 -0.735536
C  -0.991509 -0.457468 -1.113077
C  -2.358554 -1.882999 0.173169
H  5.638018 1.158282 0.020247
H  4.667297 1.675779 -1.362106
H  5.328857 2.866793 -0.253103
H  1.730301 2.926921 0.639044
H  3.089134 3.861727 0.02373
H  2.323074 2.642432 -0.994581
H  4.724787 1.450406 2.4023
H  4.493349 3.157984 2.029657
H  3.155277 2.209234 2.662863
H  -3.37414 2.979411 2.382175
H  -1.974881 2.844024 1.329247
H  -2.238296 1.653989 2.610335
H  -5.2954 1.554902 2.19614
H  -4.294247 0.165201 2.594365
H  -5.348964 0.122163 1.177279
H  -4.837017 1.613715 -0.838831
H  -3.575454 2.848038 -0.735373
H  -4.976795 2.932624 0.317968
H  4.310043 -0.484755 -0.861478
H  1.408668 1.008788 1.919181
H  3.10205 -2.58647 -0.98613
H  0.229907 -1.116334 1.820316
H  1.374982 -4.122716 0.021389
H  0.146804 -3.464691 1.101797
H  -2.655701 -2.869334 0.5046
elementType: Cl S O N C H
totalener: -1782.30702899 hartree
nucrepener: 2534.06456333 hartree
electener: -4316.37159232 hartree
oneelecener: -7480.12012195 hartree
twoeener: 3163.74852962 hartree
cpcmener: -0.02407751 hartree
kineticenergy: 1776.73548101 hartree
xcener: -132.573110547404 hartree
chargesum: -0.0000000
charge: -0.030230 -0.103570 -0.504227 0.139359 -0.265617 0.348967 0.177664 -0.081582 -0.358317 -0.331409 -0.325491 -0.331745 -0.243702 -0.327827 -0.158322 -0.197258 0.036569 -0.190905 -0.212602 0.318949 -0.135327 0.056400 -0.013292 -0.052245 0.101327 0.099710 0.099465 0.096688 0.098054 0.094159 0.100692 0.096800 0.096025 0.103176 0.110864 0.105088 0.095780 0.099620 0.101202 0.105556 0.112766 0.100992 0.143108 0.139152 0.132690 0.146948 0.140863 0.137982 0.127050
qa: -0.0302 -0.1036 -0.5042 0.1394 -0.2656 0.3490 0.1777 -0.0816 -0.3583 -0.3314 -0.3255 -0.3317 -0.2437 -0.3278 -0.1583 -0.1973 0.0366 -0.1909 -0.2126 0.3189 -0.1353 0.0564 -0.0133 -0.0522 0.1013 0.0997 0.0995 0.0967 0.0981 0.0942 0.1007 0.0968 0.0960 0.1032 0.1109 0.1051 0.0958 0.0996 0.1012 0.1056 0.1128 0.1010 0.1431 0.1392 0.1327 0.1469 0.1409 0.1380 0.1270
va: 1.3134 2.1991 1.9958 3.2290 2.9418 3.6023 3.8341 3.6965 3.9292 3.9277 3.9172 3.9101 3.8432 3.8999 3.8951 3.9838 3.5419 4.0164 3.9396 4.2765 3.9170 3.7886 3.9691 4.1370 1.0006 1.0003 1.0074 1.0036 1.0065 1.0104 1.0039 1.0034 1.0048 1.0041 1.0204 1.0039 1.0043 1.0152 1.0142 1.0045 1.0212 1.0033 0.9981 1.0020 1.0081 0.9942 0.9989 1.0028 1.0136
dispcorr: -0.029799589 hartree
energy: -1782.336828579047
dipole: 6.61095 -6.97266 -0.36171 24.08183 -24.99595 -0.91412 22.02338 -20.58961 1.43376
magnitude: 1.73843 au
magnitude: 4.41873 debye
