program: Orca
programVersion: 5.0.2
elementType: Cl S O N N C C C C C C C C C C C C C C C C C C C H H H H H H H H H H H H H H H H H H H H H H H H H
charge: 0
multiplicity: 1
keywords: wb97x-d3
keywords: def2-TZVPP
keywords: def2/J RIJCOSX
keywords: DEFGRID2
keywords: scfconv7
keywords: smallprint printgap noloewdin
keywords: NOSOSCF
formula: C19H25ClN2OS
InChI: InChI=1/C19H25ClN2OS/c1-18(2,3)14-9-7-13(8-10-14)12-24-15-11-21-22(19(4,5)6)17(23)16(15)20/h7-11H,12H2,1-6H3
49 atoms
Cl -1.805378 -2.695218 1.975355
S  -0.14175 -3.356303 -0.761555
O  -2.853341 -0.005492 1.978379
N  -2.015243 0.664911 -0.047571
N  -1.3965 0.385185 -1.182109
C  3.018304 2.444868 -0.754046
C  -2.465129 2.092898 0.108765
C  2.638003 1.005825 -0.426226
C  4.54408 2.558002 -0.853976
C  2.386628 2.834987 -2.096249
C  2.52886 3.429828 0.306668
C  -1.77306 2.712757 1.323465
C  -3.987886 2.150247 0.231637
C  -2.055843 2.891025 -1.125781
C  1.959985 0.64816 0.734443
C  2.963589 -0.021765 -1.318468
C  1.889375 -1.676208 0.071849
C  1.593708 -0.670099 0.981042
C  2.593256 -1.332954 -1.081013
C  -2.236103 -0.257427 0.956987
C  1.360233 -3.057047 0.273011
C  -0.979619 -1.841196 -0.437831
C  -1.647063 -1.567459 0.706087
C  -0.911986 -0.789634 -1.391053
H  5.023213 2.293497 0.090823
H  4.955211 1.907503 -1.627708
H  4.837049 3.581507 -1.098676
H  2.739436 2.208944 -2.91705
H  1.297997 2.750871 -2.060394
H  2.631267 3.869417 -2.34776
H  1.44215 3.412128 0.414941
H  2.967341 3.236681 1.287603
H  2.808331 4.446058 0.023228
H  -2.022306 3.773583 1.367546
H  -0.687641 2.634661 1.23454
H  -2.074498 2.267397 2.267707
H  -4.299495 3.19522 0.254072
H  -4.364355 1.6772 1.134208
H  -4.466387 1.682558 -0.630445
H  -2.524634 2.527628 -2.039225
H  -0.976776 2.91024 -1.27751
H  -2.384937 3.919209 -0.97197
H  1.693916 1.395649 1.469444
H  3.506687 0.202947 -2.228619
H  1.057864 -0.907707 1.892853
H  2.839014 -2.097056 -1.809659
H  2.062229 -3.824311 -0.056728
H  1.115206 -3.251421 1.316359
H  -0.416383 -0.941396 -2.340321
elementType: Cl S O N C H
totalener: -1782.30697107 hartree
nucrepener: 2549.29457407 hartree
electener: -4331.60154514 hartree
oneelecener: -7509.75184096 hartree
twoeener: 3178.15029581 hartree
cpcmener: -0.02252536 hartree
kineticenergy: 1776.72993930 hartree
xcener: -132.572998251087 hartree
chargesum: 0.0000000
charge: -0.035826 -0.100250 -0.497817 0.145065 -0.255730 0.334542 0.174413 -0.063103 -0.327724 -0.328993 -0.348852 -0.321523 -0.328313 -0.229252 -0.232586 -0.156126 0.050118 -0.140027 -0.231199 0.342805 -0.155988 0.130004 -0.097820 -0.081341 0.102178 0.096636 0.096882 0.100820 0.096777 0.097227 0.092358 0.102848 0.101947 0.106746 0.082003 0.116961 0.101413 0.111777 0.105001 0.102372 0.080231 0.098665 0.145720 0.139749 0.140290 0.133891 0.144407 0.131058 0.127567
qa: -0.0358 -0.1002 -0.4978 0.1451 -0.2557 0.3345 0.1744 -0.0631 -0.3277 -0.3290 -0.3489 -0.3215 -0.3283 -0.2293 -0.2326 -0.1561 0.0501 -0.1400 -0.2312 0.3428 -0.1560 0.1300 -0.0978 -0.0813 0.1022 0.0966 0.0969 0.1008 0.0968 0.0972 0.0924 0.1028 0.1019 0.1067 0.0820 0.1170 0.1014 0.1118 0.1050 0.1024 0.0802 0.0987 0.1457 0.1397 0.1403 0.1339 0.1444 0.1311 0.1276
va: 1.3079 2.2139 2.0120 3.2071 2.9269 3.6262 3.8324 3.6826 3.9148 3.9252 3.9343 3.9078 3.9015 3.8611 3.9252 3.9584 3.5114 3.9480 4.0195 4.2731 3.9330 3.7918 3.9391 4.1267 1.0039 1.0041 1.0034 1.0054 1.0015 1.0049 0.9972 1.0012 1.0085 1.0041 1.0112 1.0252 1.0029 1.0224 1.0042 1.0166 1.0079 1.0062 0.9974 1.0023 0.9999 1.0106 0.9993 1.0062 1.0190
dispcorr: -0.031415963 hartree
energy: -1782.338387033886
dipole: 18.57061 -17.11964 1.45097 44.33701 -43.40146 0.93555 -11.07555 9.83997 -1.23557
magnitude: 2.12302 au
magnitude: 5.39628 debye
