program: Orca
programVersion: 5.0.2
elementType: Cl S O N N C C C C C C C C C C C C C C C C C C C H H H H H H H H H H H H H H H H H H H H H H H H H
charge: 0
multiplicity: 1
keywords: wb97x-d3
keywords: def2-TZVPP
keywords: def2/J RIJCOSX
keywords: DEFGRID2
keywords: scfconv7
keywords: smallprint printgap noloewdin
keywords: NOSOSCF
formula: C19H25ClN2OS
InChI: InChI=1/C19H25ClN2OS/c1-18(2,3)14-9-7-13(8-10-14)12-24-15-11-21-22(19(4,5)6)17(23)16(15)20/h7-11H,12H2,1-6H3
49 atoms
Cl 0.090289 -1.496436 2.360471
S  -0.295538 -3.539971 -0.160899
O  -1.256867 1.012109 1.913193
N  -2.339744 0.457791 -0.027905
N  -2.587566 -0.404844 -0.999099
C  2.891951 2.198715 -0.038374
C  -2.990713 1.805411 -0.180064
C  2.422575 0.836017 -0.53433
C  2.496407 2.341949 1.437747
C  4.415375 2.30514 -0.171418
C  2.258945 3.350212 -0.817574
C  -1.906327 2.856695 -0.415762
C  -3.840346 2.123735 1.050969
C  -3.915478 1.788578 -1.39391
C  2.910439 -0.328181 0.068346
C  1.482978 0.679739 -1.548466
C  1.46677 -1.722717 -1.269666
C  2.440927 -1.57945 -0.284246
C  1.014128 -0.578185 -1.911249
C  -1.508242 0.194151 1.042801
C  0.83389 -3.047826 -1.542145
C  -1.130205 -1.999963 0.011273
C  -0.920535 -1.141148 1.0362
C  -2.029114 -1.564738 -0.99961
H  2.970782 1.585137 2.064572
H  2.795901 3.31958 1.822024
H  1.416629 2.248187 1.570653
H  4.935312 1.539882 0.406879
H  4.730884 2.206818 -1.212069
H  4.762491 3.275921 0.189433
H  2.618808 4.302303 -0.423467
H  2.514127 3.321069 -1.878783
H  1.170279 3.35791 -0.732827
H  -2.378791 3.819108 -0.616965
H  -1.300421 2.597488 -1.285843
H  -1.247783 2.987017 0.43911
H  -4.410295 3.032731 0.85547
H  -3.255548 2.292578 1.950052
H  -4.55664 1.32429 1.248245
H  -4.38072 2.772286 -1.461604
H  -4.713298 1.051916 -1.303348
H  -3.387311 1.610247 -2.329132
H  3.655609 -0.260756 0.85187
H  1.08247 1.540854 -2.066319
H  2.814953 -2.454557 0.234275
H  0.26706 -0.658642 -2.692475
H  0.275295 -3.045694 -2.477545
H  1.561996 -3.859701 -1.587488
H  -2.278997 -2.213694 -1.828763
elementType: Cl S O N C H
totalener: -1782.30587911 hartree
nucrepener: 2581.92227386 hartree
electener: -4364.22815297 hartree
oneelecener: -7575.78516207 hartree
twoeener: 3211.55700910 hartree
cpcmener: -0.02335692 hartree
kineticenergy: 1776.73305466 hartree
xcener: -132.573873836921 hartree
chargesum: 0.0000000
charge: -0.037007 -0.100437 -0.502391 0.154151 -0.257641 0.346766 0.188403 -0.059220 -0.327149 -0.327882 -0.347740 -0.349009 -0.324572 -0.243957 -0.145625 -0.227349 0.063604 -0.266910 -0.156255 0.284418 -0.132474 0.087474 -0.021932 -0.066213 0.097904 0.097966 0.086166 0.096030 0.101298 0.096352 0.100903 0.102952 0.088001 0.110861 0.099597 0.107780 0.101225 0.112274 0.106078 0.096387 0.102637 0.099272 0.137738 0.144290 0.130204 0.143864 0.132540 0.143596 0.133032
qa: -0.0370 -0.1004 -0.5024 0.1542 -0.2576 0.3468 0.1884 -0.0592 -0.3271 -0.3279 -0.3477 -0.3490 -0.3246 -0.2440 -0.1456 -0.2273 0.0636 -0.2669 -0.1563 0.2844 -0.1325 0.0875 -0.0219 -0.0662 0.0979 0.0980 0.0862 0.0960 0.1013 0.0964 0.1009 0.1030 0.0880 0.1109 0.0996 0.1078 0.1012 0.1123 0.1061 0.0964 0.1026 0.0993 0.1377 0.1443 0.1302 0.1439 0.1325 0.1436 0.1330
va: 1.2989 2.2196 1.9939 3.2163 2.9392 3.6056 3.8223 3.6699 3.9274 3.9137 3.9295 3.9245 3.8965 3.8442 3.9248 3.9059 3.5082 4.0287 3.9467 4.3254 3.9104 3.8269 3.9406 4.1294 1.0044 1.0066 1.0175 1.0047 1.0036 1.0033 1.0083 1.0011 1.0034 1.0080 1.0024 1.0126 1.0035 1.0215 1.0039 1.0044 1.0137 1.0144 1.0020 0.9996 1.0142 1.0043 1.0035 0.9976 1.0078
dispcorr: -0.032060222 hartree
energy: -1782.337939331643
dipole: 5.93587 -6.10521 -0.16934 36.29779 -36.30397 -0.00617 -13.18363 11.24985 -1.93378
magnitude: 1.94119 au
magnitude: 4.93412 debye
