program: Orca
programVersion: 5.0.2
elementType: Cl S O N N C C C C C C C C C C C C C C C C C C C H H H H H H H H H H H H H H H H H H H H H H H H H
charge: 0
multiplicity: 1
keywords: wb97x-d3
keywords: def2-TZVPP
keywords: def2/J RIJCOSX
keywords: DEFGRID2
keywords: scfconv7
keywords: smallprint printgap noloewdin
keywords: NOSOSCF
formula: C19H25ClN2OS
InChI: InChI=1/C19H25ClN2OS/c1-18(2,3)14-9-7-13(8-10-14)12-24-15-11-21-22(19(4,5)6)17(23)16(15)20/h7-11H,12H2,1-6H3
49 atoms
Cl -0.710792 -2.314572 2.289803
S  -0.482723 -3.393936 -0.828715
O  -1.94798 0.287543 2.416419
N  -2.442421 0.515828 0.189999
N  -2.373778 0.068236 -1.051005
C  3.360984 2.220058 -0.819058
C  -3.14135 1.836039 0.363072
C  2.785361 0.81239 -0.705657
C  2.64133 3.15705 0.158112
C  4.853225 2.166694 -0.467769
C  3.214956 2.796311 -2.226574
C  -4.324743 1.675329 1.318847
C  -3.687383 2.300204 -0.983905
C  -2.140761 2.878616 0.861186
C  2.302253 0.099052 -1.802502
C  2.7534 0.171552 0.532882
C  1.785569 -1.820462 -0.429017
C  1.813072 -1.192309 -1.66885
C  2.2577 -1.115683 0.672375
C  -1.902914 -0.145738 1.276939
C  1.254564 -3.210031 -0.266361
C  -1.205086 -1.878007 -0.319098
C  -1.291851 -1.427359 0.95458
C  -1.787987 -1.047208 -1.314629
H  1.571714 3.210276 -0.055644
H  2.756118 2.842849 1.196176
H  3.045191 4.168686 0.080444
H  5.302045 3.159736 -0.541919
H  5.019311 1.807349 0.548669
H  5.396022 1.505841 -1.145897
H  2.170739 2.862773 -2.538421
H  3.626753 3.806628 -2.254237
H  3.753142 2.210189 -2.973636
H  -4.899183 2.602358 1.324504
H  -4.028748 1.468147 2.34307
H  -4.99185 0.879442 0.983516
H  -4.199668 3.248024 -0.816381
H  -4.412195 1.604984 -1.406315
H  -2.906955 2.473389 -1.723285
H  -1.298321 2.967683 0.173612
H  -1.754127 2.661906 1.852862
H  -2.633014 3.849856 0.905887
H  2.302808 0.543476 -2.788554
H  3.120782 0.678189 1.416945
H  1.44201 -1.711084 -2.545364
H  2.245558 -1.576498 1.652666
H  1.791295 -3.920869 -0.89802
H  1.350388 -3.553157 0.761694
H  -1.757889 -1.3378 -2.356274
elementType: Cl S O N C H
totalener: -1782.30837424 hartree
nucrepener: 2503.55564685 hartree
electener: -4285.86402109 hartree
oneelecener: -7418.76818803 hartree
twoeener: 3132.90416695 hartree
cpcmener: -0.02213126 hartree
kineticenergy: 1776.74670352 hartree
xcener: -132.576805752153 hartree
chargesum: 0.0000000
charge: -0.042492 -0.084995 -0.503095 0.139115 -0.260229 0.326293 0.172671 -0.095048 -0.327479 -0.324534 -0.355681 -0.325498 -0.238963 -0.333220 -0.143276 -0.176856 0.035250 -0.232758 -0.202684 0.327488 -0.108985 0.102611 -0.063946 -0.062679 0.098849 0.097727 0.097227 0.096358 0.096680 0.101636 0.103970 0.099973 0.097962 0.100255 0.112062 0.105838 0.095415 0.101548 0.099039 0.104189 0.112184 0.102962 0.143813 0.141208 0.136204 0.135429 0.147742 0.125428 0.125291
qa: -0.0425 -0.0850 -0.5031 0.1391 -0.2602 0.3263 0.1727 -0.0950 -0.3275 -0.3245 -0.3557 -0.3255 -0.2390 -0.3332 -0.1433 -0.1769 0.0353 -0.2328 -0.2027 0.3275 -0.1090 0.1026 -0.0639 -0.0627 0.0988 0.0977 0.0972 0.0964 0.0967 0.1016 0.1040 0.1000 0.0980 0.1003 0.1121 0.1058 0.0954 0.1015 0.0990 0.1042 0.1122 0.1030 0.1438 0.1412 0.1362 0.1354 0.1477 0.1254 0.1253
va: 1.3054 2.2720 2.0043 3.2111 2.9429 3.6320 3.8406 3.7377 3.9278 3.9160 3.9266 3.8995 3.8388 3.9128 3.9061 4.0138 3.5471 4.0000 3.9752 4.2992 3.9194 3.8265 3.8916 4.1248 1.0007 1.0048 1.0043 1.0036 1.0042 1.0042 1.0009 1.0071 1.0008 1.0034 1.0222 1.0043 1.0043 1.0141 1.0156 1.0026 1.0217 1.0038 0.9989 1.0026 1.0163 1.0149 0.9989 1.0096 1.0185
dispcorr: -0.027983015 hartree
energy: -1782.336357250520
dipole: 12.94564 -12.31043 0.63521 39.95161 -39.47201 0.47960 -12.12007 10.56861 -1.55146
magnitude: 1.74371 au
magnitude: 4.43216 debye
