program: Orca
programVersion: 5.0.2
elementType: Cl S O N N C C C C C C C C C C C C C C C C C C C H H H H H H H H H H H H H H H H H H H H H H H H H
charge: 0
multiplicity: 1
keywords: wb97x-d3
keywords: def2-TZVPP
keywords: def2/J RIJCOSX
keywords: DEFGRID2
keywords: scfconv7
keywords: smallprint printgap noloewdin
keywords: NOSOSCF
formula: C19H25ClN2OS
InChI: InChI=1/C19H25ClN2OS/c1-18(2,3)14-9-7-13(8-10-14)12-24-15-11-21-22(19(4,5)6)17(23)16(15)20/h7-11H,12H2,1-6H3
49 atoms
Cl -1.780784 -2.273751 -1.993908
S  -0.044355 -3.110537 0.701056
O  -3.221516 0.190778 -1.596874
N  -2.64998 0.54846 0.593969
N  -1.953941 0.214423 1.66559
C  4.095393 2.230568 0.040794
C  -3.509455 1.775241 0.736875
C  3.32624 0.924576 -0.126762
C  3.972731 2.713555 1.491144
C  5.573764 1.989068 -0.289277
C  3.572688 3.333529 -0.878473
C  -2.997292 2.867648 -0.20151
C  -3.419552 2.290509 2.170842
C  -4.969884 1.420521 0.453836
C  3.653435 -0.183459 0.662687
C  2.301736 0.761583 -1.053734
C  1.973834 -1.546187 -0.409815
C  2.99057 -1.389881 0.530749
C  1.637882 -0.452264 -1.195458
C  -2.604276 -0.146144 -0.600097
C  1.259176 -2.847685 -0.563799
C  -1.046601 -1.677972 0.529513
C  -1.767696 -1.338885 -0.566199
C  -1.187569 -0.820271 1.654745
H  4.519091 3.649389 1.628011
H  2.931164 2.894643 1.763817
H  4.381339 1.9933 2.201494
H  6.147672 2.910146 -0.164187
H  6.022632 1.234974 0.359219
H  5.701182 1.656922 -1.321671
H  2.524929 3.571384 -0.684104
H  4.146423 4.248143 -0.718526
H  3.66938 3.073107 -1.934223
H  -3.558285 3.784547 -0.016767
H  -3.114721 2.618405 -1.252919
H  -1.944357 3.082023 -0.010898
H  -4.063454 3.167326 2.242789
H  -2.412735 2.597381 2.449348
H  -3.771951 1.5628 2.901268
H  -5.301583 0.595362 1.086434
H  -5.157784 1.15746 -0.583083
H  -5.591342 2.285059 0.690125
H  4.448058 -0.111136 1.395664
H  2.003931 1.580383 -1.694322
H  3.273653 -2.225228 1.161101
H  0.860205 -0.542817 -1.945057
H  0.835509 -2.964569 -1.559339
H  1.928983 -3.693047 -0.394818
H  -0.640229 -1.019582 2.56632
elementType: Cl S O N C H
totalener: -1782.31009196 hartree
nucrepener: 2443.38409530 hartree
electener: -4225.69418726 hartree
oneelecener: -7298.16025212 hartree
twoeener: 3072.46606486 hartree
cpcmener: -0.02186631 hartree
kineticenergy: 1776.71989599 hartree
xcener: -132.569684209040 hartree
chargesum: 0.0000000
charge: -0.040539 -0.081722 -0.500813 0.139594 -0.266900 0.327655 0.171938 -0.089762 -0.325180 -0.324173 -0.357992 -0.328980 -0.241725 -0.325229 -0.174407 -0.177250 0.055054 -0.213671 -0.172052 0.352687 -0.178487 0.075129 -0.088177 -0.043055 0.096650 0.101762 0.096362 0.096192 0.096400 0.102077 0.103048 0.099655 0.100245 0.101698 0.110511 0.107048 0.095349 0.100227 0.101729 0.106418 0.112118 0.100443 0.140492 0.145174 0.137092 0.142012 0.143580 0.147882 0.123891
qa: -0.0405 -0.0817 -0.5008 0.1396 -0.2669 0.3277 0.1719 -0.0898 -0.3252 -0.3242 -0.3580 -0.3290 -0.2417 -0.3252 -0.1744 -0.1773 0.0551 -0.2137 -0.1721 0.3527 -0.1785 0.0751 -0.0882 -0.0431 0.0967 0.1018 0.0964 0.0962 0.0964 0.1021 0.1030 0.0997 0.1002 0.1017 0.1105 0.1070 0.0953 0.1002 0.1017 0.1064 0.1121 0.1004 0.1405 0.1452 0.1371 0.1420 0.1436 0.1479 0.1239
va: 1.3045 2.2603 2.0079 3.2159 2.9527 3.6338 3.8435 3.7258 3.9171 3.9173 3.9283 3.9095 3.8407 3.8968 3.9826 3.9716 3.5188 4.0292 3.9759 4.2699 3.9002 3.8441 3.8800 4.1229 1.0038 1.0039 1.0045 1.0037 1.0044 1.0037 1.0007 1.0071 1.0008 1.0030 1.0213 1.0043 1.0044 1.0151 1.0137 1.0042 1.0222 1.0036 1.0017 0.9997 1.0083 1.0020 1.0036 0.9992 1.0197
dispcorr: -0.026436572 hartree
energy: -1782.336528532836
dipole: 19.55023 -18.25643 1.29379 38.58139 -37.98360 0.59779 10.62204 -9.41007 1.21197
magnitude: 1.87086 au
magnitude: 4.75535 debye
