program: Orca
programVersion: 5.0.2
elementType: Cl S O N N C C C C C C C C C C C C C C C C C C C H H H H H H H H H H H H H H H H H H H H H H H H H
charge: 0
multiplicity: 1
keywords: wb97x-d3
keywords: def2-TZVPP
keywords: def2/J RIJCOSX
keywords: DEFGRID2
keywords: scfconv7
keywords: smallprint printgap noloewdin
keywords: NOSOSCF
formula: C19H25ClN2OS
InChI: InChI=1/C19H25ClN2OS/c1-18(2,3)14-9-7-13(8-10-14)12-24-15-11-21-22(19(4,5)6)17(23)16(15)20/h7-11H,12H2,1-6H3
49 atoms
Cl 0.434321 -0.895346 2.126197
S  -0.316564 -3.430688 0.196485
O  -1.149175 1.422258 1.499102
N  -2.584329 0.442472 0.006524
N  -2.966321 -0.610202 -0.6995
C  3.303358 2.005118 -0.15122
C  -3.358085 1.706312 -0.249759
C  2.676563 0.688216 -0.591262
C  4.755622 2.085274 -0.633828
C  2.54514 3.216278 -0.693206
C  3.265255 2.066103 1.382014
C  -4.497597 1.414779 -1.222264
C  -2.432441 2.740365 -0.890709
C  -3.969995 2.219628 1.054135
C  1.505753 0.626101 -1.33907
C  3.247089 -0.525716 -0.193956
C  1.436318 -1.784714 -1.171479
C  0.897691 -0.589132 -1.627591
C  2.638406 -1.735783 -0.468892
C  -1.524228 0.433269 0.890065
C  0.676531 -3.058554 -1.322703
C  -1.214317 -1.917268 0.2559
C  -0.855482 -0.858034 1.018093
C  -2.333165 -1.726534 -0.598493
H  5.209949 3.026562 -0.31702
H  5.370176 1.278421 -0.231871
H  4.816463 2.038524 -1.722882
H  3.025473 4.134964 -0.35198
H  2.532078 3.242934 -1.784649
H  1.511378 3.244159 -0.34281
H  3.690605 3.006676 1.739565
H  2.239663 2.000793 1.752019
H  3.834716 1.254962 1.838559
H  -5.043918 2.346365 -1.372818
H  -5.202193 0.678377 -0.836562
H  -4.147934 1.077051 -2.196782
H  -3.016349 3.619688 -1.165501
H  -1.982603 2.344858 -1.80334
H  -1.636152 3.070924 -0.228037
H  -3.230114 2.554217 1.775804
H  -4.589267 1.453119 1.523031
H  -4.614763 3.069665 0.828007
H  1.029086 1.529715 -1.69358
H  4.170239 -0.530406 0.373241
H  -0.024733 -0.596647 -2.197617
H  3.087018 -2.653748 -0.106399
H  0.002806 -3.036531 -2.178836
H  1.328947 -3.92672 -1.428724
H  -2.698467 -2.53992 -1.211854
elementType: Cl S O N C H
totalener: -1782.30544907 hartree
nucrepener: 2565.07849842 hartree
electener: -4347.38394749 hartree
oneelecener: -7542.14568343 hartree
twoeener: 3194.76173594 hartree
cpcmener: -0.02335336 hartree
kineticenergy: 1776.74286270 hartree
xcener: -132.575259646886 hartree
chargesum: 0.0000000
charge: -0.030497 -0.103591 -0.504961 0.146092 -0.264299 0.353279 0.180068 -0.063200 -0.324048 -0.355104 -0.326939 -0.242243 -0.337324 -0.325803 -0.206894 -0.181727 0.027876 -0.156517 -0.217159 0.300815 -0.133799 0.063473 -0.007420 -0.054455 0.096799 0.095954 0.100541 0.100690 0.101374 0.094285 0.097496 0.085393 0.097439 0.095488 0.101259 0.099152 0.105741 0.105792 0.109603 0.112346 0.105416 0.100698 0.141636 0.137619 0.142499 0.131387 0.136661 0.140835 0.128273
qa: -0.0305 -0.1036 -0.5050 0.1461 -0.2643 0.3533 0.1801 -0.0632 -0.3240 -0.3551 -0.3269 -0.2422 -0.3373 -0.3258 -0.2069 -0.1817 0.0279 -0.1565 -0.2172 0.3008 -0.1338 0.0635 -0.0074 -0.0545 0.0968 0.0960 0.1005 0.1007 0.1014 0.0943 0.0975 0.0854 0.0974 0.0955 0.1013 0.0992 0.1057 0.1058 0.1096 0.1123 0.1054 0.1007 0.1416 0.1376 0.1425 0.1314 0.1367 0.1408 0.1283
va: 1.3121 2.2027 1.9896 3.2294 2.9407 3.5936 3.8307 3.6861 3.9149 3.9358 3.9193 3.8443 3.9118 3.9000 3.9073 3.9656 3.5461 3.9173 4.0245 4.2869 3.9163 3.8051 3.9569 4.1322 1.0034 1.0049 1.0036 1.0079 1.0009 1.0020 1.0073 1.0210 1.0033 1.0046 1.0144 1.0150 1.0056 1.0031 1.0189 1.0214 1.0043 1.0037 0.9977 1.0033 0.9980 1.0085 1.0023 0.9990 1.0131
dispcorr: -0.031177959 hartree
energy: -1782.336627029550
dipole: 4.93025 -5.39031 -0.46006 31.36745 -31.73084 -0.36340 -13.83256 12.21112 -1.62144
magnitude: 1.72417 au
magnitude: 4.38250 debye
