program: Orca
programVersion: 5.0.2
elementType: Cl S O N N C C C C C C C C C C C C C C C C C C C H H H H H H H H H H H H H H H H H H H H H H H H H
charge: 0
multiplicity: 1
keywords: wb97x-d3
keywords: def2-TZVPP
keywords: def2/J RIJCOSX
keywords: DEFGRID2
keywords: scfconv7
keywords: smallprint printgap noloewdin
keywords: NOSOSCF
formula: C19H25ClN2OS
InChI: InChI=1/C19H25ClN2OS/c1-18(2,3)14-9-7-13(8-10-14)12-24-15-11-21-22(19(4,5)6)17(23)16(15)20/h7-11H,12H2,1-6H3
49 atoms
Cl -1.607419 -2.182128 2.766495
S  -0.053701 -3.191124 0.225234
O  -3.0958 0.266699 2.291661
N  -2.486811 0.577725 0.101245
N  -1.880986 0.144183 -0.988288
C  3.896002 2.250576 -0.886553
C  -3.217219 1.883314 -0.038484
C  3.238251 0.876015 -0.954064
C  4.583977 2.611774 -2.20601
C  2.799773 3.284412 -0.596474
C  4.948486 2.319076 0.22312
C  -4.714818 1.660258 0.172493
C  -3.007364 2.434259 -1.446572
C  -2.646407 2.898025 0.953567
C  2.729355 0.368854 -2.148315
C  3.049714 0.10161 0.192494
C  1.872848 -1.605021 -1.045375
C  2.058803 -0.845538 -2.193822
C  2.384353 -1.113369 0.150776
C  -2.488019 -0.111867 1.302242
C  1.136761 -2.911945 -1.127081
C  -1.019783 -1.740532 0.186855
C  -1.687445 -1.319521 1.290991
C  -1.192428 -0.94368 -0.979588
H  5.093349 3.571856 -2.106581
H  5.332814 1.869181 -2.488721
H  3.883456 2.713192 -3.035487
H  3.221539 4.290699 -0.535712
H  2.039952 3.288962 -1.380947
H  2.296318 3.078355 0.350511
H  5.439423 3.293822 0.206703
H  4.521663 2.19976 1.219542
H  5.721962 1.558915 0.096213
H  -5.245328 2.591108 -0.03286
H  -4.963712 1.358368 1.186497
H  -5.096966 0.904867 -0.516351
H  -3.537282 3.385517 -1.505907
H  -3.410749 1.783994 -2.221808
H  -1.958512 2.627718 -1.671204
H  -1.569345 3.011649 0.817289
H  -2.837242 2.640627 1.992016
H  -3.105759 3.869629 0.766894
H  2.837372 0.923156 -3.071098
H  3.417799 0.444748 1.150315
H  1.666504 -1.198561 -3.140907
H  2.251158 -1.67243 1.069475
H  0.647052 -3.030268 -2.094043
H  1.819384 -3.759366 -1.020626
H  -0.759747 -1.224968 -1.928374
elementType: Cl S O N C H
totalener: -1782.31091877 hartree
nucrepener: 2444.59848427 hartree
electener: -4226.90940303 hartree
oneelecener: -7300.53367041 hartree
twoeener: 3073.62426738 hartree
cpcmener: -0.02522670 hartree
kineticenergy: 1776.71836386 hartree
xcener: -132.576267410395 hartree
chargesum: -0.0000000
charge: -0.051860 -0.060059 -0.509396 0.129427 -0.258224 0.266376 0.176608 -0.042003 -0.332667 -0.329483 -0.330496 -0.327972 -0.243630 -0.328201 -0.175140 -0.177095 -0.043603 -0.186025 -0.184526 0.337184 -0.068218 0.083709 -0.081833 -0.063501 0.097576 0.109233 0.094196 0.098687 0.099486 0.099728 0.097376 0.094450 0.108340 0.100638 0.110393 0.105069 0.095459 0.099924 0.100482 0.106318 0.111813 0.100769 0.146351 0.145406 0.140440 0.127533 0.126513 0.146345 0.138100
qa: -0.0519 -0.0601 -0.5094 0.1294 -0.2582 0.2664 0.1766 -0.0420 -0.3327 -0.3295 -0.3305 -0.3280 -0.2436 -0.3282 -0.1751 -0.1771 -0.0436 -0.1860 -0.1845 0.3372 -0.0682 0.0837 -0.0818 -0.0635 0.0976 0.1092 0.0942 0.0987 0.0995 0.0997 0.0974 0.0945 0.1083 0.1006 0.1104 0.1051 0.0955 0.0999 0.1005 0.1063 0.1118 0.1008 0.1464 0.1454 0.1404 0.1275 0.1265 0.1463 0.1381
va: 1.2998 2.3731 1.9993 3.2074 2.9514 3.6970 3.8390 3.7027 3.9050 3.9253 3.9061 3.9039 3.8434 3.8992 3.9515 3.9762 3.6288 3.9645 3.9723 4.2941 3.8818 3.8030 3.9084 4.0998 1.0050 1.0018 1.0041 1.0032 1.0038 1.0036 1.0050 1.0046 1.0019 1.0033 1.0226 1.0041 1.0043 1.0150 1.0142 1.0045 1.0227 1.0034 0.9980 0.9988 1.0051 1.0246 1.0101 0.9946 1.0006
dispcorr: -0.026075007 hartree
energy: -1782.336993772563
dipole: 18.62303 -17.18217 1.44086 39.48275 -39.06661 0.41614 -20.57676 18.10449 -2.47227
magnitude: 2.89160 au
magnitude: 7.34986 debye
