program: Orca
programVersion: 5.0.2
elementType: Cl S O N N C C C C C C C C C C C C C C C C C C C H H H H H H H H H H H H H H H H H H H H H H H H H
charge: 0
multiplicity: 1
keywords: wb97x-d3
keywords: def2-TZVPP
keywords: def2/J RIJCOSX
keywords: DEFGRID2
keywords: scfconv7
keywords: smallprint printgap noloewdin
keywords: NOSOSCF
formula: C19H25ClN2OS
InChI: InChI=1/C19H25ClN2OS/c1-18(2,3)14-9-7-13(8-10-14)12-24-15-11-21-22(19(4,5)6)17(23)16(15)20/h7-11H,12H2,1-6H3
49 atoms
Cl -2.052978 -2.652386 -1.654895
S  0.010004 -3.368136 0.790816
O  -3.173677 -0.006804 -1.373849
N  -2.206826 0.538501 0.632003
N  -1.408958 0.236548 1.641542
C  3.455521 2.308947 -0.14839
C  -2.828654 1.908097 0.687728
C  2.919279 0.884664 -0.250592
C  4.520652 2.452066 0.937315
C  4.078934 2.720364 -1.488042
C  2.294929 3.256002 0.184889
C  -4.353374 1.789002 0.673537
C  -2.308412 2.74599 -0.480957
C  -2.421938 2.596239 1.987993
C  3.345793 -0.147517 0.583998
C  1.950374 0.572115 -1.206048
C  1.854159 -1.727736 -0.473506
C  2.820267 -1.427748 0.479163
C  1.427556 -0.706565 -1.318438
C  -2.448918 -0.301868 -0.438071
C  1.240094 -3.08679 -0.55252
C  -0.918542 -1.880136 0.65968
C  -1.758356 -1.58266 -0.359399
C  -0.790936 -0.893095 1.673459
H  4.877056 3.483244 0.968619
H  4.134607 2.213812 1.930345
H  5.388594 1.816364 0.75099
H  3.357787 2.688103 -2.306109
H  4.461465 3.742052 -1.432234
H  4.913772 2.069383 -1.755671
H  2.652986 4.28424 0.273852
H  1.523743 3.245632 -0.587361
H  1.820996 2.987038 1.131275
H  -4.783288 2.774882 0.85473
H  -4.70033 1.128864 1.470492
H  -4.750487 1.428283 -0.270837
H  -2.680164 3.766101 -0.378281
H  -2.630341 2.376896 -1.451185
H  -1.217554 2.79059 -0.472431
H  -1.346805 2.751779 2.067702
H  -2.758595 2.057006 2.872872
H  -2.898405 3.576902 1.998621
H  4.099766 0.03299 1.338094
H  1.587223 1.337914 -1.880871
H  3.168612 -2.201308 1.154023
H  0.680906 -0.910779 -2.077264
H  0.76609 -3.262952 -1.51698
H  1.975254 -3.877503 -0.394689
H  -0.146186 -1.062751 2.525267
elementType: Cl S O N C H
totalener: -1782.30894910 hartree
nucrepener: 2505.48044778 hartree
electener: -4287.78939688 hartree
oneelecener: -7422.28701899 hartree
twoeener: 3134.49762211 hartree
cpcmener: -0.02185295 hartree
kineticenergy: 1776.71545500 hartree
xcener: -132.568738297842 hartree
chargesum: 0.0000000
charge: -0.036871 -0.093026 -0.498872 0.141450 -0.257489 0.341250 0.169691 -0.080284 -0.358137 -0.325497 -0.338466 -0.326676 -0.320510 -0.240262 -0.149962 -0.214500 0.047724 -0.195774 -0.186243 0.345743 -0.162090 0.107580 -0.093166 -0.065023 0.099771 0.100657 0.102151 0.096631 0.096590 0.101916 0.100934 0.092967 0.103973 0.101674 0.105982 0.111742 0.103615 0.111068 0.095076 0.098658 0.102282 0.095559 0.145263 0.141121 0.134370 0.140188 0.136392 0.146572 0.124257
qa: -0.0369 -0.0930 -0.4989 0.1414 -0.2575 0.3412 0.1697 -0.0803 -0.3581 -0.3255 -0.3385 -0.3267 -0.3205 -0.2403 -0.1500 -0.2145 0.0477 -0.1958 -0.1862 0.3457 -0.1621 0.1076 -0.0932 -0.0650 0.0998 0.1007 0.1022 0.0966 0.0966 0.1019 0.1009 0.0930 0.1040 0.1017 0.1060 0.1117 0.1036 0.1111 0.0951 0.0987 0.1023 0.0956 0.1453 0.1411 0.1344 0.1402 0.1364 0.1466 0.1243
va: 1.3088 2.2308 2.0111 3.2145 2.9420 3.6178 3.8411 3.7183 3.9283 3.9176 3.9260 3.8971 3.9166 3.8481 3.8975 4.0214 3.5209 4.0195 3.9674 4.2742 3.9165 3.8184 3.9177 4.1233 1.0077 1.0006 1.0003 1.0040 1.0038 1.0037 1.0059 1.0021 1.0032 1.0031 1.0042 1.0220 1.0040 1.0223 1.0032 1.0132 1.0139 1.0041 0.9976 1.0030 1.0115 1.0018 1.0050 0.9992 1.0220
dispcorr: -0.028921049 hartree
energy: -1782.337870150978
dipole: 19.78038 -18.31179 1.46859 42.76661 -41.94072 0.82589 6.99470 -6.00729 0.98741
magnitude: 1.95290 au
magnitude: 4.96389 debye
