program: Orca
programVersion: 5.0.2
elementType: Cl S O N N C C C C C C C C C C C C C C C C C C C H H H H H H H H H H H H H H H H H H H H H H H H H
charge: 0
multiplicity: 1
keywords: wb97x-d3
keywords: def2-TZVPP
keywords: def2/J RIJCOSX
keywords: DEFGRID2
keywords: scfconv7
keywords: smallprint printgap noloewdin
keywords: NOSOSCF
formula: C19H25ClN2OS
InChI: InChI=1/C19H25ClN2OS/c1-18(2,3)14-9-7-13(8-10-14)12-24-15-11-21-22(19(4,5)6)17(23)16(15)20/h7-11H,12H2,1-6H3
49 atoms
Cl -1.751083 -2.457171 -1.918536
S  -0.132677 -3.411579 0.774112
O  -2.684531 0.265202 -1.692566
N  -2.033606 0.648011 0.472985
N  -1.45009 0.236061 1.585338
C  3.061614 2.409905 0.116051
C  -2.534568 2.065551 0.49814
C  2.636039 0.956101 -0.056287
C  4.581206 2.479269 0.309376
C  2.691164 3.26833 -1.092198
C  2.363699 2.992169 1.351851
C  -1.755964 2.893948 -0.524095
C  -2.292839 2.6639 1.881826
C  -4.039707 2.092725 0.228671
C  2.90489 0.025622 0.954348
C  1.967068 0.492608 -1.184187
C  1.821413 -1.744515 -0.277606
C  2.505842 -1.29445 0.850648
C  1.56427 -0.833992 -1.292379
C  -2.158935 -0.12789 -0.663946
C  1.297206 -3.13977 -0.363764
C  -0.961169 -1.871088 0.585301
C  -1.597494 -1.46716 -0.538315
C  -0.935936 -0.94172 1.658761
H  4.9018 3.515165 0.440623
H  4.911658 1.923265 1.188046
H  5.11042 2.076541 -0.556592
H  1.613563 3.291505 -1.267486
H  3.01264 4.297936 -0.925783
H  3.173654 2.922923 -2.008756
H  2.65203 4.035588 1.498065
H  1.276521 2.961106 1.245764
H  2.62172 2.451303 2.263823
H  -1.936777 2.588539 -1.551846
H  -0.682236 2.839387 -0.331783
H  -2.053079 3.939627 -0.435316
H  -2.820527 2.127222 2.670199
H  -2.673068 3.685795 1.866442
H  -1.23669 2.70826 2.146525
H  -4.303969 1.782617 -0.778497
H  -4.401844 3.112661 0.363144
H  -4.573953 1.457874 0.937742
H  3.430521 0.335721 1.849626
H  1.736518 1.161213 -2.002337
H  2.716106 -1.980631 1.66316
H  1.037604 -1.154711 -2.183716
H  1.002937 -3.395844 -1.380091
H  2.029154 -3.87797 -0.032545
H  -0.462568 -1.201412 2.596053
elementType: Cl S O N C H
totalener: -1782.30728551 hartree
nucrepener: 2550.34590858 hartree
electener: -4332.65319410 hartree
oneelecener: -7512.07736180 hartree
twoeener: 3179.42416770 hartree
cpcmener: -0.02202894 hartree
kineticenergy: 1776.72214742 hartree
xcener: -132.571762283870 hartree
chargesum: -0.0000000
charge: -0.036320 -0.095143 -0.499709 0.152398 -0.252972 0.332360 0.161923 -0.077731 -0.327583 -0.358297 -0.313601 -0.295719 -0.237564 -0.327432 -0.152443 -0.204877 0.071552 -0.255537 -0.163778 0.324559 -0.147953 0.121992 -0.073916 -0.085504 0.097007 0.096472 0.102308 0.100703 0.100407 0.104416 0.098570 0.082839 0.099140 0.114292 0.060701 0.105637 0.103187 0.095934 0.096081 0.112113 0.101497 0.106000 0.140974 0.143452 0.134789 0.139417 0.131283 0.146905 0.127170
qa: -0.0363 -0.0951 -0.4997 0.1524 -0.2530 0.3324 0.1619 -0.0777 -0.3276 -0.3583 -0.3136 -0.2957 -0.2376 -0.3274 -0.1524 -0.2049 0.0716 -0.2555 -0.1638 0.3246 -0.1480 0.1220 -0.0739 -0.0855 0.0970 0.0965 0.1023 0.1007 0.1004 0.1044 0.0986 0.0828 0.0991 0.1143 0.0607 0.1056 0.1032 0.0959 0.0961 0.1121 0.1015 0.1060 0.1410 0.1435 0.1348 0.1394 0.1313 0.1469 0.1272
va: 1.3115 2.2353 2.0100 3.2040 2.9342 3.6292 3.8571 3.7070 3.9157 3.9314 3.9391 3.9108 3.8428 3.9006 3.9568 3.9374 3.4980 4.0203 3.9645 4.2822 3.9272 3.8222 3.9526 4.1321 1.0033 1.0046 1.0035 0.9954 1.0077 1.0008 1.0058 0.9974 1.0046 1.0231 1.0114 1.0067 1.0148 1.0047 1.0154 1.0222 1.0030 1.0042 1.0019 1.0001 1.0128 1.0087 1.0045 0.9987 1.0203
dispcorr: -0.030871027 hartree
energy: -1782.338156538717
dipole: 17.88806 -16.56751 1.32055 42.84745 -42.14739 0.70005 9.65343 -8.39095 1.26248
magnitude: 1.95647 au
magnitude: 4.97295 debye
