program: Orca
programVersion: 5.0.2
elementType: Cl S O N N C C C C C C C C C C C C C C C C C C C H H H H H H H H H H H H H H H H H H H H H H H H H
charge: 0
multiplicity: 1
keywords: wb97x-d3
keywords: def2-TZVPP
keywords: def2/J RIJCOSX
keywords: DEFGRID2
keywords: scfconv7
keywords: smallprint printgap noloewdin
keywords: NOSOSCF
formula: C19H25ClN2OS
InChI: InChI=1/C19H25ClN2OS/c1-18(2,3)14-9-7-13(8-10-14)12-24-15-11-21-22(19(4,5)6)17(23)16(15)20/h7-11H,12H2,1-6H3
49 atoms
Cl -1.25894 -2.357096 2.358711
S  -0.258365 -3.188099 -0.674753
O  -2.629498 0.176327 2.366838
N  -2.619891 0.555007 0.107129
N  -2.243775 0.209824 -1.111317
C  3.790152 2.253895 -1.071827
C  -3.39938 1.839909 0.205679
C  3.147672 0.901771 -0.777748
C  4.787007 2.593013 0.043285
C  4.539788 2.264534 -2.40325
C  2.702042 3.332594 -1.125125
C  -4.753252 1.580516 0.868388
C  -3.660154 2.381311 -1.196864
C  -2.574904 2.87185 0.974158
C  2.444158 0.710317 0.412983
C  3.233032 -0.18453 -1.647371
C  1.962219 -1.589577 -0.145601
C  1.864126 -0.508728 0.726399
C  2.648493 -1.405364 -1.339944
C  -2.308615 -0.168408 1.241578
C  1.33643 -2.902642 0.192687
C  -1.160157 -1.739003 -0.261242
C  -1.569255 -1.396278 0.983708
C  -1.549832 -0.857566 -1.30633
H  5.579513 1.844783 0.109613
H  5.259195 3.559364 -0.147971
H  4.306836 2.654979 1.020985
H  5.35082 1.533991 -2.427312
H  3.881721 2.065939 -3.251383
H  4.986274 3.247306 -2.565478
H  1.972758 3.122964 -1.910231
H  2.158759 3.418159 -0.182561
H  3.144421 4.30913 -1.335318
H  -4.680484 1.324572 1.921284
H  -5.292412 0.782701 0.354617
H  -5.358113 2.484767 0.792863
H  -4.235534 3.300806 -1.085819
H  -4.248135 1.697532 -1.808487
H  -2.746417 2.627532 -1.735073
H  -1.608848 3.033794 0.492796
H  -2.401713 2.596887 2.01158
H  -3.107587 3.823764 0.971274
H  2.349138 1.522449 1.123639
H  3.766859 -0.097342 -2.584045
H  1.344279 -0.621043 1.670748
H  2.7374 -2.227444 -2.041116
H  1.950012 -3.738003 -0.150243
H  1.196732 -3.022561 1.265485
H  -1.268437 -1.064285 -2.330284
elementType: Cl S O N C H
totalener: -1782.30983181 hartree
nucrepener: 2457.74041338 hartree
electener: -4240.05024519 hartree
oneelecener: -7326.86870138 hartree
twoeener: 3086.81845620 hartree
cpcmener: -0.02191397 hartree
kineticenergy: 1776.72035353 hartree
xcener: -132.569424981109 hartree
chargesum: 0.0000000
charge: -0.039580 -0.084960 -0.502201 0.140230 -0.266091 0.328451 0.172347 -0.087820 -0.325441 -0.357467 -0.325528 -0.323864 -0.242493 -0.328955 -0.191838 -0.155722 0.048886 -0.200553 -0.186333 0.351836 -0.172225 0.081389 -0.088928 -0.045412 0.101899 0.096439 0.096791 0.101201 0.100941 0.099946 0.101571 0.095959 0.096705 0.111860 0.105815 0.100741 0.095110 0.101461 0.100500 0.106285 0.110645 0.102204 0.140420 0.144802 0.142616 0.135910 0.147230 0.141649 0.123571
qa: -0.0396 -0.0850 -0.5022 0.1402 -0.2661 0.3285 0.1723 -0.0878 -0.3254 -0.3575 -0.3255 -0.3239 -0.2425 -0.3290 -0.1918 -0.1557 0.0489 -0.2006 -0.1863 0.3518 -0.1722 0.0814 -0.0889 -0.0454 0.1019 0.0964 0.0968 0.1012 0.1009 0.0999 0.1016 0.0960 0.0967 0.1119 0.1058 0.1007 0.0951 0.1015 0.1005 0.1063 0.1106 0.1022 0.1404 0.1448 0.1426 0.1359 0.1472 0.1416 0.1236
va: 1.3061 2.2546 2.0061 3.2146 2.9512 3.6324 3.8405 3.7232 3.9177 3.9270 3.9211 3.8952 3.8421 3.9136 4.0396 3.9042 3.5261 3.9799 4.0229 4.2700 3.9011 3.8429 3.8929 4.1221 1.0035 1.0039 1.0044 1.0008 1.0005 1.0070 1.0041 1.0039 1.0042 1.0222 1.0045 1.0034 1.0043 1.0138 1.0151 1.0038 1.0213 1.0031 1.0038 0.9978 1.0018 1.0098 0.9990 1.0042 1.0200
dispcorr: -0.026869276 hartree
energy: -1782.336701083265
dipole: 16.34920 -15.41042 0.93877 39.92613 -39.26321 0.66292 -14.58808 13.12673 -1.46135
magnitude: 1.85911 au
magnitude: 4.72549 debye
