program: Orca
programVersion: 5.0.2
elementType: Cl S O N N C C C C C C C C C C C C C C C C C C C H H H H H H H H H H H H H H H H H H H H H H H H H
charge: 0
multiplicity: 1
keywords: wb97x-d3
keywords: def2-TZVPP
keywords: def2/J RIJCOSX
keywords: DEFGRID2
keywords: scfconv7
keywords: smallprint printgap noloewdin
keywords: NOSOSCF
formula: C19H25ClN2OS
InChI: InChI=1/C19H25ClN2OS/c1-18(2,3)14-9-7-13(8-10-14)12-24-15-11-21-22(19(4,5)6)17(23)16(15)20/h7-11H,12H2,1-6H3
49 atoms
Cl -1.288244 -2.627218 2.069049
S  -0.295178 -3.170361 -1.02363
O  -2.488429 -0.021633 2.357434
N  -2.432776 0.604162 0.152785
N  -2.073472 0.369152 -1.096865
C  3.569103 2.347631 -0.795759
C  -3.1220 1.920492 0.39188
C  2.971834 0.959537 -0.594171
C  3.342553 3.256106 0.411372
C  5.080142 2.215613 -1.023924
C  2.925558 3.007528 -2.021166
C  -2.248938 2.793122 1.293206
C  -4.505985 1.680437 0.997019
C  -3.309018 2.643114 -0.939379
C  3.059331 0.008184 -1.616815
C  2.339849 0.570667 0.582213
C  1.905316 -1.643845 -0.288037
C  2.533253 -1.262422 -1.472793
C  1.81618 -0.709079 0.734047
C  -2.185086 -0.262016 1.200795
C  1.307645 -3.003518 -0.13495
C  -1.13646 -1.731664 -0.466266
C  -1.532909 -1.503881 0.808301
C  -1.452993 -0.715866 -1.407917
H  3.782002 4.236892 0.220473
H  2.281551 3.411383 0.617951
H  3.809115 2.865034 1.317509
H  5.531315 3.199326 -1.172496
H  5.572622 1.751501 -0.167052
H  5.312196 1.615041 -1.90504
H  3.340761 4.005624 -2.178515
H  3.097931 2.437859 -2.935503
H  1.84614 3.113817 -1.894866
H  -1.257271 2.931669 0.858382
H  -2.132764 2.39104 2.296356
H  -2.70886 3.777825 1.385682
H  -5.039864 2.63052 1.038636
H  -4.473873 1.280643 2.006365
H  -5.091452 1.002193 0.373911
H  -3.928104 2.082283 -1.639026
H  -2.366286 2.881468 -1.429585
H  -3.818875 3.583735 -0.729332
H  3.549812 0.259294 -2.549677
H  2.243559 1.2600 1.410002
H  2.614325 -1.969206 -2.290738
H  1.342178 -0.97597 1.67152
H  1.928237 -3.77302 -0.597607
H  1.17561 -3.274519 0.911036
H  -1.174832 -0.827073 -2.44737
elementType: Cl S O N C H
totalener: -1782.30960831 hartree
nucrepener: 2483.77067586 hartree
electener: -4266.08028417 hartree
oneelecener: -7378.95446660 hartree
twoeener: 3112.87418243 hartree
cpcmener: -0.02170205 hartree
kineticenergy: 1776.72369416 hartree
xcener: -132.570691230303 hartree
chargesum: 0.0000000
charge: -0.038152 -0.087643 -0.501042 0.140753 -0.262687 0.327417 0.171388 -0.081542 -0.357843 -0.324606 -0.326268 -0.330513 -0.325144 -0.242997 -0.166294 -0.189232 0.049895 -0.225427 -0.159497 0.351348 -0.167749 0.095393 -0.094168 -0.053672 0.099907 0.102301 0.100199 0.096637 0.102051 0.095731 0.096676 0.096191 0.101822 0.104803 0.111793 0.102777 0.100893 0.111873 0.105511 0.102262 0.100959 0.095743 0.141117 0.143435 0.135730 0.140380 0.147663 0.138638 0.123189
qa: -0.0382 -0.0876 -0.5010 0.1408 -0.2627 0.3274 0.1714 -0.0815 -0.3578 -0.3246 -0.3263 -0.3305 -0.3251 -0.2430 -0.1663 -0.1892 0.0499 -0.2254 -0.1595 0.3513 -0.1677 0.0954 -0.0942 -0.0537 0.0999 0.1023 0.1002 0.0966 0.1021 0.0957 0.0967 0.0962 0.1018 0.1048 0.1118 0.1028 0.1009 0.1119 0.1055 0.1023 0.1010 0.0957 0.1411 0.1434 0.1357 0.1404 0.1477 0.1386 0.1232
va: 1.3081 2.2492 2.0078 3.2155 2.9455 3.6317 3.8414 3.7212 3.9300 3.9162 3.9194 3.9120 3.8972 3.8426 3.9773 3.9641 3.5223 4.0306 3.9666 4.2658 3.9106 3.8346 3.9126 4.1219 1.0071 1.0007 1.0009 1.0037 1.0038 1.0046 1.0038 1.0047 1.0041 1.0039 1.0216 1.0034 1.0034 1.0221 1.0045 1.0138 1.0145 1.0041 1.0013 1.0004 1.0100 1.0045 0.9991 1.0046 1.0209
dispcorr: -0.027664544 hartree
energy: -1782.337272853937
dipole: 16.52618 -15.55892 0.96726 41.92159 -41.11497 0.80662 -10.36457 8.93202 -1.43255
magnitude: 1.90746 au
magnitude: 4.84838 debye
