program: Orca
programVersion: 5.0.2
elementType: Cl S O N N C C C C C C C C C C C C C C C C C C C H H H H H H H H H H H H H H H H H H H H H H H H H
charge: 0
multiplicity: 1
keywords: wb97x-d3
keywords: def2-TZVPP
keywords: def2/J RIJCOSX
keywords: DEFGRID2
keywords: scfconv7
keywords: smallprint printgap noloewdin
keywords: NOSOSCF
formula: C19H25ClN2OS
InChI: InChI=1/C19H25ClN2OS/c1-18(2,3)14-9-7-13(8-10-14)12-24-15-11-21-22(19(4,5)6)17(23)16(15)20/h7-11H,12H2,1-6H3
49 atoms
Cl -1.837231 -2.700705 -1.597254
S  -0.062674 -3.240509 1.112415
O  -3.001789 -0.062028 -1.606411
N  -2.233314 0.63516 0.437513
N  -1.550997 0.407141 1.545734
C  3.452228 2.338567 -0.192953
C  -2.863908 1.997767 0.334533
C  2.876574 0.927082 -0.207698
C  2.99657 3.163677 -1.395768
C  2.998776 3.058763 1.08315
C  4.983562 2.255333 -0.216803
C  -4.381915 1.85381 0.221446
C  -2.266788 2.746105 -0.857747
C  -2.5548 2.795353 1.5981
C  3.194889 0.0345 0.822578
C  2.038002 0.461577 -1.214452
C  1.861869 -1.713653 -0.17323
C  2.697626 -1.255279 0.844257
C  1.53688 -0.835821 -1.197324
C  -2.36789 -0.281301 -0.58728
C  1.280661 -3.088087 -0.13823
C  -0.966829 -1.7715 0.772979
C  -1.686359 -1.546671 -0.351046
C  -0.946119 -0.715789 1.723489
H  3.432647 4.162781 -1.342347
H  3.312677 2.723289 -2.343453
H  1.911761 3.286026 -1.426025
H  1.910028 3.132764 1.130866
H  3.336173 2.548389 1.986528
H  3.402298 4.073398 1.112484
H  5.421851 3.25607 -0.210436
H  5.380636 1.721233 0.64775
H  5.338446 1.74385 -1.113781
H  -4.780086 1.27293 1.055334
H  -4.704015 1.389739 -0.70658
H  -4.835065 2.84516 0.267084
H  -2.652794 3.766106 -0.86375
H  -2.514577 2.296908 -1.815579
H  -1.179604 2.805621 -0.773596
H  -1.487963 2.961713 1.742682
H  -2.956709 2.33242 2.498318
H  -3.028702 3.771435 1.489635
H  3.845741 0.349799 1.6293
H  1.757306 1.10387 -2.037961
H  2.960595 -1.914565 1.66356
H  0.890278 -1.162869 -2.003307
H  0.905419 -3.393331 -1.113352
H  2.011172 -3.832323 0.183756
H  -0.397953 -0.822906 2.649825
elementType: Cl S O N C H
totalener: -1782.30933226 hartree
nucrepener: 2507.50393975 hartree
electener: -4289.81327201 hartree
oneelecener: -7426.38628812 hartree
twoeener: 3136.57301610 hartree
cpcmener: -0.02188301 hartree
kineticenergy: 1776.73174817 hartree
xcener: -132.572282968469 hartree
chargesum: 0.0000000
charge: -0.036398 -0.092524 -0.500707 0.145417 -0.258914 0.335126 0.170001 -0.081037 -0.354686 -0.326422 -0.326712 -0.327773 -0.323706 -0.238976 -0.162138 -0.197336 0.055589 -0.235443 -0.158177 0.343932 -0.159735 0.110222 -0.093577 -0.067033 0.099967 0.101618 0.097815 0.099097 0.096698 0.097021 0.096059 0.096079 0.102579 0.106030 0.111542 0.100830 0.102609 0.112247 0.098909 0.099304 0.100966 0.095126 0.140887 0.144140 0.134686 0.139572 0.135325 0.146858 0.125041
qa: -0.0364 -0.0925 -0.5007 0.1454 -0.2589 0.3351 0.1700 -0.0810 -0.3547 -0.3264 -0.3267 -0.3278 -0.3237 -0.2390 -0.1621 -0.1973 0.0556 -0.2354 -0.1582 0.3439 -0.1597 0.1102 -0.0936 -0.0670 0.1000 0.1016 0.0978 0.0991 0.0967 0.0970 0.0961 0.0961 0.1026 0.1060 0.1115 0.1008 0.1026 0.1122 0.0989 0.0993 0.1010 0.0951 0.1409 0.1441 0.1347 0.1396 0.1353 0.1469 0.1250
va: 1.3104 2.2376 2.0081 3.2131 2.9407 3.6213 3.8412 3.7241 3.9308 3.9250 3.9153 3.9013 3.9113 3.8450 3.9716 3.9577 3.5096 4.0276 3.9629 4.2733 3.9178 3.8233 3.9282 4.1235 1.0073 1.0009 1.0009 1.0038 1.0045 1.0037 1.0035 1.0045 1.0035 1.0040 1.0220 1.0032 1.0039 1.0223 1.0040 1.0135 1.0144 1.0044 1.0017 0.9999 1.0117 1.0056 1.0051 0.9989 1.0211
dispcorr: -0.028666341 hartree
energy: -1782.337998598541
dipole: 19.10043 -17.70066 1.39977 42.85899 -41.98930 0.86969 4.63476 -3.54778 1.08698
magnitude: 1.97414 au
magnitude: 5.01787 debye
