program: Orca
programVersion: 5.0.2
elementType: Cl S O N N C C C C C C C C C C C C C C C C C C C H H H H H H H H H H H H H H H H H H H H H H H H H
charge: 0
multiplicity: 1
keywords: wb97x-d3
keywords: def2-TZVPP
keywords: def2/J RIJCOSX
keywords: DEFGRID2
keywords: scfconv7
keywords: smallprint printgap noloewdin
keywords: NOSOSCF
formula: C19H25ClN2OS
InChI: InChI=1/C19H25ClN2OS/c1-18(2,3)14-9-7-13(8-10-14)12-24-15-11-21-22(19(4,5)6)17(23)16(15)20/h7-11H,12H2,1-6H3
49 atoms
Cl -1.151028 -2.411734 2.420684
S  -0.315225 -3.437685 -0.584387
O  -2.168359 0.289022 2.38321
N  -2.070479 0.636598 0.119294
N  -1.805137 0.197188 -1.099308
C  2.845441 2.404164 -1.09531
C  -2.519887 2.070088 0.202466
C  2.510194 0.957831 -0.749559
C  2.809928 3.314118 0.131525
C  4.250418 2.478592 -1.705532
C  1.821645 2.924857 -2.111654
C  -3.908486 2.15027 0.836847
C  -2.605038 2.654934 -1.204712
C  -1.484667 2.873112 0.990783
C  2.161962 0.550276 0.533691
C  2.529883 -0.023636 -1.747353
C  1.837099 -1.734188 -0.191264
C  1.831123 -0.771743 0.808442
C  2.198596 -1.33928 -1.478406
C  -1.911193 -0.121003 1.263099
C  1.374978 -3.124915 0.094862
C  -1.073535 -1.893369 -0.217396
C  -1.390046 -1.461911 1.025019
C  -1.338038 -0.988614 -1.280207
H  3.530121 3.008128 0.892897
H  3.060293 4.335609 -0.159985
H  1.822017 3.344925 0.595233
H  5.007453 2.12084 -1.004958
H  4.33709 1.888114 -2.618547
H  4.49804 3.510978 -1.962021
H  2.039793 3.961817 -2.377135
H  1.82575 2.343515 -3.034909
H  0.808022 2.893515 -1.705244
H  -4.254365 3.183674 0.793335
H  -3.922771 1.844123 1.879072
H  -4.625555 1.539868 0.28542
H  -3.323229 2.132676 -1.836088
H  -1.642717 2.665364 -1.715689
H  -2.938484 3.688778 -1.10886
H  -1.751527 3.929889 0.953471
H  -0.492714 2.767757 0.546494
H  -1.424112 2.586997 2.037798
H  2.134677 1.259438 1.349628
H  2.800888 0.241391 -2.762446
H  1.560845 -1.047437 1.821011
H  2.206249 -2.065922 -2.282922
H  1.991489 -3.876096 -0.400943
H  1.378301 -3.340247 1.161881
H  -1.134072 -1.272819 -2.303779
elementType: Cl S O N C H
totalener: -1782.30708488 hartree
nucrepener: 2554.50835113 hartree
electener: -4336.81543601 hartree
oneelecener: -7520.35518832 hartree
twoeener: 3183.53975230 hartree
cpcmener: -0.02201608 hartree
kineticenergy: 1776.73047698 hartree
xcener: -132.573707836271 hartree
chargesum: 0.0000000
charge: -0.035441 -0.095702 -0.499447 0.149402 -0.253687 0.333444 0.165769 -0.069806 -0.361477 -0.328590 -0.310802 -0.328835 -0.239219 -0.289656 -0.214298 -0.154698 0.064646 -0.156763 -0.245921 0.328884 -0.150714 0.120456 -0.076915 -0.084081 0.104470 0.100556 0.104012 0.101870 0.096887 0.096802 0.098776 0.099370 0.078496 0.101194 0.112644 0.105871 0.104180 0.098007 0.096322 0.106841 0.049997 0.114657 0.144012 0.139133 0.138951 0.135259 0.146728 0.131922 0.126491
qa: -0.0354 -0.0957 -0.4994 0.1494 -0.2537 0.3334 0.1658 -0.0698 -0.3615 -0.3286 -0.3108 -0.3288 -0.2392 -0.2897 -0.2143 -0.1547 0.0646 -0.1568 -0.2459 0.3289 -0.1507 0.1205 -0.0769 -0.0841 0.1045 0.1006 0.1040 0.1019 0.0969 0.0968 0.0988 0.0994 0.0785 0.1012 0.1126 0.1059 0.1042 0.0980 0.0963 0.1068 0.0500 0.1147 0.1440 0.1391 0.1390 0.1353 0.1467 0.1319 0.1265
va: 1.3125 2.2333 2.0104 3.2053 2.9322 3.6289 3.8526 3.6904 3.9327 3.9158 3.9413 3.9016 3.8404 3.9082 3.9349 3.9590 3.5054 3.9677 4.0180 4.2784 3.9275 3.8167 3.9519 4.1306 1.0008 1.0077 0.9914 1.0036 1.0046 1.0035 1.0063 1.0047 0.9971 1.0031 1.0223 1.0040 1.0158 1.0150 1.0045 1.0062 1.0160 1.0236 0.9996 1.0024 1.0075 1.0117 0.9989 1.0043 1.0207
dispcorr: -0.031225454 hartree
energy: -1782.338310337137
dipole: 14.57590 -13.59670 0.97920 42.79609 -42.10248 0.69361 -15.82048 14.21817 -1.60231
magnitude: 2.00183 au
magnitude: 5.08826 debye
