program: Orca
programVersion: 5.0.2
elementType: Cl S O N N C C C C C C C C C C C C C C C C C C C H H H H H H H H H H H H H H H H H H H H H H H H H
charge: 0
multiplicity: 1
keywords: wb97x-d3
keywords: def2-TZVPP
keywords: def2/J RIJCOSX
keywords: DEFGRID2
keywords: scfconv7
keywords: smallprint printgap noloewdin
keywords: NOSOSCF
formula: C19H25ClN2OS
InChI: InChI=1/C19H25ClN2OS/c1-18(2,3)14-9-7-13(8-10-14)12-24-15-11-21-22(19(4,5)6)17(23)16(15)20/h7-11H,12H2,1-6H3
49 atoms
Cl -2.614761 -2.265365 -1.880936
S  -0.09691 -3.146758 -0.221833
O  -3.831855 0.173789 -0.895769
N  -2.407552 0.544446 0.86423
N  -1.390473 0.158757 1.611926
C  4.039224 2.287075 -0.664768
C  -3.070916 1.827632 1.281326
C  3.399308 0.930618 -0.39011
C  5.529278 2.229148 -0.306285
C  3.911027 2.704198 -2.129143
C  3.349693 3.350933 0.19968
C  -4.518968 1.550036 1.68521
C  -2.981266 2.844713 0.142923
C  -2.339268 2.406637 2.48938
C  2.789001 0.161943 -1.378701
C  3.39459 0.415284 0.907316
C  2.164688 -1.544966 0.212506
C  2.18266 -1.053071 -1.08582
C  2.78729 -0.793039 1.204753
C  -2.869532 -0.170345 -0.227056
C  1.51335 -2.84976 0.574312
C  -1.014173 -1.727574 0.204892
C  -2.097834 -1.359025 -0.525297
C  -0.720925 -0.90406 1.328791
H  5.689891 1.979156 0.743552
H  6.054639 1.485947 -0.909191
H  6.002792 3.196871 -0.486776
H  4.374765 3.681392 -2.275399
H  4.409965 2.00613 -2.804087
H  2.869064 2.791074 -2.443507
H  2.283061 3.414655 -0.024909
H  3.452035 3.145135 1.266141
H  3.787332 4.334432 0.015062
H  -4.958179 2.464768 2.08472
H  -4.563526 0.792635 2.469882
H  -5.140705 1.222946 0.855899
H  -3.553171 2.558893 -0.735762
H  -1.943619 3.003762 -0.156196
H  -3.372847 3.800818 0.492823
H  -1.297513 2.64464 2.27585
H  -2.370491 1.750915 3.358423
H  -2.841861 3.336214 2.758565
H  2.766823 0.504086 -2.404455
H  3.860565 0.967976 1.714051
H  1.706307 -1.608188 -1.885259
H  2.789417 -1.151368 2.227918
H  2.108923 -3.697862 0.225793
H  1.427257 -2.96013 1.655467
H  0.076757 -1.144732 2.015724
elementType: Cl S O N C H
totalener: -1782.31218262 hartree
nucrepener: 2432.27225202 hartree
electener: -4214.58443464 hartree
oneelecener: -7275.85997672 hartree
twoeener: 3061.27554208 hartree
cpcmener: -0.02551984 hartree
kineticenergy: 1776.71822818 hartree
xcener: -132.576525391470 hartree
chargesum: -0.0000000
charge: -0.052371 -0.059051 -0.511624 0.129759 -0.258999 0.327977 0.174936 -0.104862 -0.324641 -0.357499 -0.328397 -0.328142 -0.327562 -0.241064 -0.156179 -0.167819 -0.040336 -0.166960 -0.208546 0.337559 -0.066085 0.081041 -0.079780 -0.061111 0.096625 0.101570 0.096777 0.099915 0.100499 0.102061 0.103572 0.096248 0.096511 0.100681 0.104960 0.111176 0.111700 0.106132 0.100190 0.100357 0.098843 0.095570 0.145497 0.140442 0.127115 0.141216 0.146312 0.127815 0.137970
qa: -0.0524 -0.0591 -0.5116 0.1298 -0.2590 0.3280 0.1749 -0.1049 -0.3246 -0.3575 -0.3284 -0.3281 -0.3276 -0.2411 -0.1562 -0.1678 -0.0403 -0.1670 -0.2085 0.3376 -0.0661 0.0810 -0.0798 -0.0611 0.0966 0.1016 0.0968 0.0999 0.1005 0.1021 0.1036 0.0962 0.0965 0.1007 0.1050 0.1112 0.1117 0.1061 0.1002 0.1004 0.0988 0.0956 0.1455 0.1404 0.1271 0.1412 0.1463 0.1278 0.1380
va: 1.3003 2.3792 1.9964 3.2064 2.9504 3.6331 3.8424 3.7439 3.9173 3.9286 3.9197 3.9034 3.8997 3.8403 3.9318 3.9853 3.6245 3.9737 3.9771 4.2941 3.8795 3.8050 3.9062 4.0937 1.0043 1.0038 1.0034 1.0071 1.0005 1.0008 1.0033 1.0044 1.0039 1.0033 1.0040 1.0224 1.0229 1.0048 1.0035 1.0145 1.0156 1.0042 0.9983 1.0022 1.0255 1.0047 0.9943 1.0095 1.0014
dispcorr: -0.025659379 hartree
energy: -1782.337841999162
dipole: 25.65107 -23.28785 2.36322 39.63735 -39.18655 0.45080 12.00624 -10.26609 1.74015
magnitude: 2.96920 au
magnitude: 7.54710 debye
