program: Orca
programVersion: 5.0.2
elementType: Cl S O N N C C C C C C C C C C C C C C C C C C C H H H H H H H H H H H H H H H H H H H H H H H H H
charge: 0
multiplicity: 1
keywords: wb97x-d3
keywords: def2-TZVPP
keywords: def2/J RIJCOSX
keywords: DEFGRID2
keywords: scfconv7
keywords: smallprint printgap noloewdin
keywords: NOSOSCF
formula: C19H25ClN2OS
InChI: InChI=1/C19H25ClN2OS/c1-18(2,3)14-9-7-13(8-10-14)12-24-15-11-21-22(19(4,5)6)17(23)16(15)20/h7-11H,12H2,1-6H3
49 atoms
Cl -2.25699 -2.041402 -2.304971
S  -0.058959 -3.080498 -0.304361
O  -3.645372 0.315877 -1.339476
N  -2.518943 0.551367 0.645169
N  -1.616267 0.118809 1.50376
C  4.248877 2.230366 -0.2535
C  -3.288005 1.769877 1.070261
C  3.519151 0.920401 0.020663
C  5.42561 1.972477 -1.202796
C  3.275093 3.218263 -0.907673
C  4.797038 2.864922 1.023676
C  -2.745065 2.2726 2.404836
C  -4.759398 1.400482 1.258821
C  -3.10754 2.886629 0.040607
C  3.023253 0.162023 -1.044529
C  3.298463 0.429086 1.303194
C  2.134992 -1.512001 0.448864
C  2.348097 -1.027807 -0.839837
C  2.614906 -0.763123 1.513898
C  -2.792724 -0.076724 -0.558678
C  1.432264 -2.813698 0.707054
C  -1.018111 -1.668355 0.046875
C  -1.969213 -1.238536 -0.821207
C  -0.899266 -0.920386 1.251532
H  6.131263 1.256528 -0.776914
H  5.101777 1.583722 -2.169214
H  5.969602 2.900038 -1.393582
H  3.776183 4.165093 -1.121366
H  2.8781 2.838463 -1.850637
H  2.427329 3.43207 -0.25381
H  5.327356 3.786889 0.77879
H  4.007012 3.126898 1.730057
H  5.504746 2.210619 1.536706
H  -3.320559 3.157278 2.678307
H  -1.69725 2.566157 2.34713
H  -2.854369 1.546729 3.208958
H  -5.300896 2.272202 1.627464
H  -4.868124 0.606622 1.999859
H  -5.241154 1.08114 0.338484
H  -2.049737 3.095715 -0.125962
H  -3.565815 3.797148 0.427511
H  -3.571025 2.669076 -0.917076
H  3.160484 0.504514 -2.063025
H  3.65059 0.972417 2.169467
H  1.976685 -1.579036 -1.695592
H  2.455532 -1.108535 2.529103
H  2.062849 -3.661601 0.426565
H  1.203681 -2.940724 1.765304
H  -0.205848 -1.201621 2.030102
elementType: Cl S O N C H
totalener: -1782.31235486 hartree
nucrepener: 2425.42584942 hartree
electener: -4207.73820427 hartree
oneelecener: -7262.19509028 hartree
twoeener: 3054.45688601 hartree
cpcmener: -0.02540064 hartree
kineticenergy: 1776.73051227 hartree
xcener: -132.578596175886 hartree
chargesum: 0.0000000
charge: -0.051788 -0.060825 -0.510036 0.129827 -0.259500 0.323241 0.180517 -0.098796 -0.327229 -0.324226 -0.356172 -0.243430 -0.331904 -0.327332 -0.175029 -0.154996 -0.044014 -0.202269 -0.170638 0.338381 -0.065294 0.086503 -0.086387 -0.062053 0.102491 0.096429 0.096349 0.096573 0.096498 0.102440 0.100053 0.098770 0.103538 0.095577 0.101434 0.098407 0.101053 0.104822 0.111559 0.106401 0.099973 0.112449 0.142023 0.145675 0.129359 0.139941 0.147706 0.126799 0.137129
qa: -0.0518 -0.0608 -0.5100 0.1298 -0.2595 0.3232 0.1805 -0.0988 -0.3272 -0.3242 -0.3562 -0.2434 -0.3319 -0.3273 -0.1750 -0.1550 -0.0440 -0.2023 -0.1706 0.3384 -0.0653 0.0865 -0.0864 -0.0621 0.1025 0.0964 0.0963 0.0966 0.0965 0.1024 0.1001 0.0988 0.1035 0.0956 0.1014 0.0984 0.1011 0.1048 0.1116 0.1064 0.1000 0.1124 0.1420 0.1457 0.1294 0.1399 0.1477 0.1268 0.1371
va: 1.2996 2.3720 1.9977 3.2095 2.9536 3.6410 3.8341 3.7434 3.9179 3.9188 3.9259 3.8412 3.9095 3.8946 4.0133 3.9098 3.6302 3.9943 3.9642 4.2934 3.8759 3.7955 3.9081 4.0990 1.0030 1.0050 1.0039 1.0036 1.0043 1.0042 1.0072 1.0008 1.0007 1.0044 1.0139 1.0158 1.0031 1.0040 1.0220 1.0047 1.0035 1.0229 1.0023 0.9980 1.0240 1.0059 0.9936 1.0101 1.0004
dispcorr: -0.025482428 hartree
energy: -1782.337837283816
dipole: 23.78928 -21.74737 2.04190 37.49765 -37.19664 0.30100 15.73789 -13.72292 2.01497
magnitude: 2.88446 au
magnitude: 7.33170 debye
