program: Orca
programVersion: 5.0.2
elementType: Cl S O N N C C C C C C C C C C C C C C C C C C C H H H H H H H H H H H H H H H H H H H H H H H H H
charge: 0
multiplicity: 1
keywords: wb97x-d3
keywords: def2-TZVPP
keywords: def2/J RIJCOSX
keywords: DEFGRID2
keywords: scfconv7
keywords: smallprint printgap noloewdin
keywords: NOSOSCF
formula: C19H25ClN2OS
InChI: InChI=1/C19H25ClN2OS/c1-18(2,3)14-9-7-13(8-10-14)12-24-15-11-21-22(19(4,5)6)17(23)16(15)20/h7-11H,12H2,1-6H3
49 atoms
Cl -1.613721 -2.249451 2.77865
S  -0.001179 -3.139665 0.240994
O  -3.151276 0.179129 2.361891
N  -2.529715 0.569404 0.189038
N  -1.892928 0.189855 -0.903495
C  3.95669 2.269587 -1.020815
C  -3.31505 1.847223 0.072417
C  3.268169 0.908946 -1.022855
C  4.514499 2.635461 0.353437
C  5.115374 2.256852 -2.024455
C  2.941804 3.344559 -1.430933
C  -4.80311 1.551673 0.257647
C  -3.11369 2.440952 -1.31916
C  -2.803324 2.861809 1.095316
C  3.152506 0.112957 0.114868
C  2.701848 0.419247 -2.200791
C  1.90014 -1.568066 -1.084962
C  2.481056 -1.102359 0.087175
C  2.031229 -0.791778 -2.232623
C  -2.523117 -0.153693 1.368778
C  1.143923 -2.864584 -1.147863
C  -0.995859 -1.70919 0.224791
C  -1.690328 -1.339024 1.331504
C  -1.17274 -0.877401 -0.917635
H  5.268579 1.924331 0.696038
H  4.991667 3.615899 0.307259
H  3.733568 2.691732 1.114119
H  5.622723 3.22403 -2.031131
H  5.855227 1.496332 -1.767736
H  4.776066 2.06046 -3.042629
H  2.538191 3.168964 -2.429081
H  2.101358 3.384158 -0.735098
H  3.412966 4.329934 -1.439057
H  -5.049034 1.204551 1.257368
H  -5.142981 0.804903 -0.461842
H  -5.371245 2.464885 0.076823
H  -2.073032 2.690288 -1.523157
H  -3.688607 3.366274 -1.363678
H  -3.475312 1.790351 -2.113815
H  -2.986844 2.566914 2.124515
H  -3.311809 3.812499 0.930511
H  -1.733278 3.035462 0.969018
H  3.579048 0.434739 1.055154
H  2.767267 0.993664 -3.116725
H  2.398337 -1.677289 1.001888
H  1.589886 -1.131324 -3.162802
H  0.619639 -2.971216 -2.097856
H  1.818508 -3.721495 -1.069897
H  -0.717051 -1.113938 -1.867422
elementType: Cl S O N C H
totalener: -1782.31209486 hartree
nucrepener: 2433.64224045 hartree
electener: -4215.95433531 hartree
oneelecener: -7278.59910727 hartree
twoeener: 3062.64477196 hartree
cpcmener: -0.02547830 hartree
kineticenergy: 1776.72324656 hartree
xcener: -132.577632342202 hartree
chargesum: 0.0000000
charge: -0.052766 -0.057130 -0.510727 0.129276 -0.258925 0.330231 0.178215 -0.105847 -0.356590 -0.324391 -0.328710 -0.328496 -0.244403 -0.327688 -0.155543 -0.164269 -0.033749 -0.171276 -0.215631 0.337970 -0.068161 0.080672 -0.082741 -0.060493 0.101222 0.099281 0.101191 0.096466 0.101504 0.095613 0.096956 0.103183 0.096727 0.110868 0.105007 0.100066 0.100969 0.095468 0.099591 0.112226 0.100306 0.105979 0.145456 0.140999 0.127766 0.142455 0.127406 0.146989 0.137480
qa: -0.0528 -0.0571 -0.5107 0.1293 -0.2589 0.3302 0.1782 -0.1058 -0.3566 -0.3244 -0.3287 -0.3285 -0.2444 -0.3277 -0.1555 -0.1643 -0.0337 -0.1713 -0.2156 0.3380 -0.0682 0.0807 -0.0827 -0.0605 0.1012 0.0993 0.1012 0.0965 0.1015 0.0956 0.0970 0.1032 0.0967 0.1109 0.1050 0.1001 0.1010 0.0955 0.0996 0.1122 0.1003 0.1060 0.1455 0.1410 0.1278 0.1425 0.1274 0.1470 0.1375
va: 1.2997 2.3812 1.9976 3.2089 2.9542 3.6323 3.8371 3.7466 3.9276 3.9178 3.9204 3.9049 3.8428 3.8983 3.9289 3.9806 3.6142 3.9783 3.9785 4.2933 3.8787 3.8054 3.9011 4.0938 1.0006 1.0072 1.0007 1.0036 1.0038 1.0048 1.0042 1.0035 1.0037 1.0228 1.0040 1.0035 1.0139 1.0044 1.0152 1.0228 1.0034 1.0048 0.9981 1.0019 1.0246 1.0044 1.0100 0.9946 1.0024
dispcorr: -0.025680221 hartree
energy: -1782.337775077583
dipole: 18.43426 -16.97339 1.46087 39.49563 -39.04219 0.45344 -21.30722 18.77234 -2.53488
magnitude: 2.96064 au
magnitude: 7.52535 debye
