program: Orca
programVersion: 5.0.2
elementType: Cl S O N N C C C C C C C C C C C C C C C C C C C H H H H H H H H H H H H H H H H H H H H H H H H H
charge: 0
multiplicity: 1
keywords: wb97x-d3
keywords: def2-TZVPP
keywords: def2/J RIJCOSX
keywords: DEFGRID2
keywords: scfconv7
keywords: smallprint printgap noloewdin
keywords: NOSOSCF
formula: C19H25ClN2OS
InChI: InChI=1/C19H25ClN2OS/c1-18(2,3)14-9-7-13(8-10-14)12-24-15-11-21-22(19(4,5)6)17(23)16(15)20/h7-11H,12H2,1-6H3
49 atoms
Cl -1.976219 -2.722895 2.363932
S  0.085619 -2.892343 0.050256
O  -3.717129 -0.392363 2.199204
N  -2.823018 0.519276 0.293931
N  -1.95144 0.476205 -0.692808
C  4.565232 2.25648 -0.93624
C  -3.758737 1.690174 0.285144
C  3.676979 1.020043 -1.009084
C  5.126625 2.482966 0.46721
C  5.744588 2.090531 -1.90334
C  3.744174 3.490785 -1.332174
C  -3.445314 2.575982 -0.918568
C  -3.559571 2.517876 1.556798
C  -5.201114 1.194876 0.159216
C  3.100979 0.647167 -2.223579
C  3.390275 0.224821 0.095492
C  2.001926 -1.250198 -1.213452
C  2.28248 -0.463111 -2.325945
C  2.567512 -0.888377 -0.000832
C  -2.906108 -0.442248 1.29928
C  1.134112 -2.469767 -1.368098
C  -1.030761 -1.555221 0.149758
C  -1.929769 -1.509698 1.165759
C  -1.09909 -0.483698 -0.787173
H  5.761553 3.370003 0.471841
H  4.338916 2.646866 1.20444
H  5.739228 1.64483 0.803675
H  6.397814 2.964408 -1.863471
H  6.341699 1.213889 -1.649123
H  5.41713 1.976797 -2.937221
H  4.361403 4.390413 -1.290975
H  3.347502 3.413076 -2.3451
H  2.899132 3.632398 -0.657263
H  -4.141346 3.41512 -0.898954
H  -3.574035 2.05647 -1.866441
H  -2.434575 2.979052 -0.890074
H  -3.832559 1.975772 2.45705
H  -4.182513 3.411394 1.500518
H  -2.522849 2.845872 1.645474
H  -5.521548 0.614007 1.018693
H  -5.324597 0.588864 -0.739548
H  -5.865064 2.05541 0.068874
H  3.283731 1.2357 -3.114167
H  3.804536 0.466139 1.064311
H  1.852192 -0.716412 -3.288655
H  2.356438 -1.470516 0.88745
H  0.529362 -2.411741 -2.275197
H  1.751974 -3.365273 -1.477246
H  -0.424832 -0.411742 -1.626342
totalener: -1782.28979560 hartree
nucrepener: 2387.73981562 hartree
electener: -4170.02961122 hartree
oneelecener: -7186.33432972 hartree
twoeener: 3016.30471851 hartree
kineticenergy: 1776.77559462 hartree
xcener: -132.584239518989 hartree
chargesum: 0.0000000
charge: -0.027707 -0.026049 -0.409947 0.114313 -0.242434 0.249213 0.133586 -0.063161 -0.335928 -0.289149 -0.288204 -0.211133 -0.309350 -0.309727 -0.134401 -0.136256 -0.049687 -0.192879 -0.117582 0.303839 -0.101624 0.096528 -0.100016 -0.060559 0.091694 0.095427 0.097383 0.088214 0.100045 0.086101 0.088174 0.086655 0.100673 0.080035 0.094997 0.096765 0.126908 0.083892 0.092360 0.127393 0.092132 0.084071 0.109604 0.122494 0.113366 0.116770 0.111016 0.133853 0.088290
qa: -0.0277 -0.0260 -0.4099 0.1143 -0.2424 0.2492 0.1336 -0.0632 -0.3359 -0.2891 -0.2882 -0.2111 -0.3093 -0.3097 -0.1344 -0.1363 -0.0497 -0.1929 -0.1176 0.3038 -0.1016 0.0965 -0.1000 -0.0606 0.0917 0.0954 0.0974 0.0882 0.1000 0.0861 0.0882 0.0867 0.1007 0.0800 0.0950 0.0968 0.1269 0.0839 0.0924 0.1274 0.0921 0.0841 0.1096 0.1225 0.1134 0.1168 0.1110 0.1339 0.0883
va: 1.3307 2.4107 2.0966 3.1677 2.9672 3.7649 3.9367 3.7604 3.9320 3.9216 3.9213 3.8379 3.8982 3.8990 4.0595 3.9965 3.6736 4.0373 4.0068 4.2816 3.9100 3.7358 3.9194 4.0806 1.0117 1.0023 1.0024 1.0066 1.0061 1.0081 1.0065 1.0079 1.0065 1.0067 1.0188 1.0179 1.0224 1.0061 1.0078 1.0225 1.0077 1.0062 1.0106 1.0053 1.0112 1.0322 1.0105 0.9943 1.0286
dispcorr: -0.024772267 hartree
energy: -1782.314567864714
dipole: 21.67674 -20.34295 1.33379 40.42829 -39.71845 0.70984 -17.53580 16.05584 -1.47996
magnitude: 2.11498 au
magnitude: 5.37586 debye
