program: Orca
programVersion: 5.0.2
elementType: Cl S O N N C C C C C C C C C C C C C C C C C C C H H H H H H H H H H H H H H H H H H H H H H H H H
charge: 0
multiplicity: 1
keywords: wb97x-d3
keywords: def2-TZVPP
keywords: def2/J RIJCOSX
keywords: DEFGRID2
keywords: scfconv7
keywords: smallprint printgap noloewdin
keywords: NOSOSCF
formula: C19H25ClN2OS
InChI: InChI=1/C19H25ClN2OS/c1-18(2,3)14-9-7-13(8-10-14)12-24-15-11-21-22(19(4,5)6)17(23)16(15)20/h7-11H,12H2,1-6H3
49 atoms
Cl -1.019638 -2.506943 2.268655
S  -0.381656 -3.296053 -0.859398
O  -2.094146 0.166786 2.492083
N  -2.225973 0.646127 0.252768
N  -2.001177 0.317101 -1.007087
C  3.130107 2.391386 -1.04835
C  -2.80821 2.010796 0.469701
C  2.700464 0.942788 -0.845478
C  4.348957 2.689954 -0.165331
C  3.507405 2.686648 -2.499641
C  1.970743 3.318355 -0.657424
C  -4.136634 1.895442 1.220787
C  -3.079087 2.665842 -0.883385
C  -1.803739 2.876125 1.233739
C  2.660987 0.01018 -1.879246
C  2.314595 0.50433 0.420251
C  1.848688 -1.715927 -0.399765
C  2.239707 -1.292592 -1.662761
C  1.896556 -0.796599 0.642278
C  -1.919573 -0.165216 1.339211
C  1.31568 -3.093303 -0.175671
C  -1.114592 -1.790536 -0.323223
C  -1.364514 -1.464996 0.965824
C  -1.474687 -0.819841 -1.298941
H  4.134116 2.544671 0.893662
H  5.187981 2.042345 -0.423149
H  4.671712 3.724949 -0.294591
H  3.803221 3.731987 -2.599271
H  4.349263 2.07952 -2.836711
H  2.672576 2.520191 -3.182497
H  1.682359 3.1966 0.38736
H  2.251064 4.364082 -0.798829
H  1.088171 3.121698 -1.268734
H  -4.590189 2.884995 1.287783
H  -4.019263 1.512941 2.229884
H  -4.832081 1.25171 0.680392
H  -3.511346 3.648241 -0.691949
H  -3.787808 2.101196 -1.486933
H  -2.173636 2.807064 -1.470433
H  -0.854887 2.927525 0.697105
H  -1.618157 2.510875 2.239642
H  -2.193579 3.8917 1.311683
H  2.954995 0.291612 -2.880835
H  2.330978 1.188334 1.25982
H  2.200414 -1.98446 -2.496174
H  1.597467 -1.09618 1.639626
H  1.895804 -3.846709 -0.710997
H  1.315486 -3.36076 0.879552
H  -1.300184 -1.014146 -2.348064
totalener: -1782.28743940 hartree
nucrepener: 2523.41198834 hartree
electener: -4305.69942774 hartree
oneelecener: -7457.83932653 hartree
twoeener: 3152.13989880 hartree
kineticenergy: 1776.77751008 hartree
xcener: -132.577817289709 hartree
chargesum: -0.0000000
charge: -0.019098 -0.058997 -0.404257 0.129786 -0.237155 0.266008 0.128354 -0.031738 -0.288529 -0.336383 -0.307514 -0.309946 -0.207843 -0.299504 -0.114653 -0.188665 0.081627 -0.183054 -0.195401 0.302824 -0.186439 0.093930 -0.097940 -0.069478 0.088530 0.099263 0.088962 0.091581 0.096085 0.095585 0.084538 0.095219 0.095787 0.085034 0.127854 0.093420 0.080381 0.097945 0.094749 0.073134 0.125633 0.088031 0.119143 0.114362 0.109173 0.126860 0.130574 0.126723 0.105501
qa: -0.0191 -0.0590 -0.4043 0.1298 -0.2372 0.2660 0.1284 -0.0317 -0.2885 -0.3364 -0.3075 -0.3099 -0.2078 -0.2995 -0.1147 -0.1887 0.0816 -0.1831 -0.1954 0.3028 -0.1864 0.0939 -0.0979 -0.0695 0.0885 0.0993 0.0890 0.0916 0.0961 0.0956 0.0845 0.0952 0.0958 0.0850 0.1279 0.0934 0.0804 0.0979 0.0947 0.0731 0.1256 0.0880 0.1191 0.1144 0.1092 0.1269 0.1306 0.1267 0.1055
va: 1.3338 2.2677 2.1009 3.1719 2.9399 3.7444 3.9344 3.7185 3.9212 3.9326 3.9314 3.8981 3.8440 3.9094 3.9415 4.0954 3.5357 4.0725 4.0489 4.2684 3.9617 3.8271 3.9369 4.1268 1.0077 1.0066 1.0061 1.0121 1.0023 1.0021 1.0035 1.0108 1.0034 1.0060 1.0216 1.0079 1.0068 1.0179 1.0179 1.0105 1.0221 1.0090 1.0051 1.0102 1.0188 1.0130 1.0005 1.0066 1.0277
dispcorr: -0.029387468 hartree
energy: -1782.316826868194
dipole: 14.05313 -13.40166 0.65147 42.37475 -41.79981 0.57493 -12.68557 11.70290 -0.98267
magnitude: 1.31172 au
magnitude: 3.33412 debye
