program: Orca
programVersion: 5.0.2
elementType: O O O O N N N C C C C C C C C C C C C C C C C C C C C C C C C H H H H H H H H H H H H H H H H H H H H H H H H H H H
charge: 0
multiplicity: 1
keywords: wb97x-d3
keywords: def2-TZVPP
keywords: def2/J RIJCOSX
keywords: DEFGRID2
keywords: scfconv7
keywords: smallprint printgap noloewdin
keywords: NOSOSCF
formula: C24H27N3O4
InChI: InChI=1/C24H27N3O4/c1-17-21(22(27(5)26-17)30-20-9-7-6-8-10-20)15-25-29-16-18-11-13-19(14-12-18)23(28)31-24(2,3)4/h6-15H,16H2,1-5H3
58 atoms
O  4.389607 -0.188601 -0.664385
O  -2.864271 -0.849757 1.423963
O  -1.89263 2.825741 -0.833597
O  4.854061 0.741863 1.326325
N  -4.800356 -1.760286 0.506906
N  -5.71724 -1.522831 -0.441513
N  -2.419405 1.692729 -0.254325
C  5.583943 -1.027356 -0.773699
C  6.83508 -0.167215 -0.867245
C  5.359331 -1.766904 -2.084125
C  5.657393 -2.024212 0.374185
C  4.135252 0.599066 0.360769
C  2.838617 1.308962 0.219056
C  -4.119633 0.063608 -0.515424
C  -3.839844 -0.829914 0.503978
C  -5.317789 -0.438658 -1.073866
C  0.368005 2.616336 0.080003
C  2.054635 1.219969 -0.929598
C  2.373503 2.055849 1.298431
C  0.834783 1.871431 -0.999071
C  1.147615 2.692954 1.230218
C  -0.917418 3.392953 0.01295
C  -6.086823 0.129483 -2.211419
C  -3.403197 1.243156 -0.927197
C  -4.959587 -2.856923 1.431769
C  -1.570197 -1.129892 1.030429
C  -0.580117 -0.832766 1.955585
C  -1.260032 -1.702219 -0.19278
C  0.740373 -1.122379 1.649662
C  0.070036 -1.97893 -0.485326
C  1.072893 -1.695229 0.428672
H  7.68546 -0.807599 -1.103359
H  6.747663 0.570886 -1.665791
H  7.064909 0.350364 0.061828
H  5.273107 -1.076258 -2.924294
H  6.203084 -2.427178 -2.282054
H  4.457819 -2.380511 -2.046362
H  5.928191 -1.56622 1.322734
H  6.419159 -2.769232 0.142311
H  4.710161 -2.551919 0.499146
H  2.384644 0.641913 -1.78143
H  2.958216 2.127214 2.20561
H  0.250058 1.793464 -1.906356
H  0.791421 3.257417 2.083521
H  -0.720383 4.381142 -0.409749
H  -1.317667 3.547369 1.019274
H  -6.411874 1.149179 -2.001373
H  -5.485418 0.1632 -3.120763
H  -6.972177 -0.469698 -2.416512
H  -3.749004 1.741198 -1.832788
H  -3.988038 -3.211846 1.763331
H  -5.469382 -3.6691 0.92259
H  -5.544957 -2.555799 2.299483
H  -0.842187 -0.381447 2.904202
H  -2.028617 -1.937494 -0.917659
H  1.51415 -0.890613 2.369497
H  0.315688 -2.421293 -1.441789
H  2.106308 -1.907664 0.188714
elementType: O N C H
totalener: -1396.04645266 hartree
nucrepener: 3089.63668823 hartree
electener: -4485.68314088 hartree
oneelecener: -8044.75439662 hartree
twoeener: 3559.07125574 hartree
cpcmener: -0.04286212 hartree
kineticenergy: 1390.02587528 hartree
xcener: -134.854158921665 hartree
chargesum: -0.0000000
charge: -0.290743 -0.332818 -0.258285 -0.504599 0.123616 -0.339729 -0.188330 0.252921 -0.304199 -0.289531 -0.317486 0.547480 -0.004351 -0.120095 0.208954 0.076020 0.013865 -0.205295 -0.164898 -0.198360 -0.174157 0.117283 -0.278654 0.104294 -0.163812 0.310506 -0.263807 -0.159994 -0.144056 -0.203007 -0.136457 0.106955 0.104155 0.101614 0.103945 0.101249 0.105469 0.101502 0.110073 0.107201 0.151037 0.138398 0.139615 0.143428 0.115736 0.101846 0.111251 0.109269 0.097638 0.104773 0.118382 0.116248 0.125683 0.144687 0.155941 0.154909 0.157134 0.159585
qa: -0.2907 -0.3328 -0.2583 -0.5046 0.1236 -0.3397 -0.1883 0.2529 -0.3042 -0.2895 -0.3175 0.5475 -0.0044 -0.1201 0.2090 0.0760 0.0139 -0.2053 -0.1649 -0.1984 -0.1742 0.1173 -0.2787 0.1043 -0.1638 0.3105 -0.2638 -0.1600 -0.1441 -0.2030 -0.1365 0.1070 0.1042 0.1016 0.1039 0.1012 0.1055 0.1015 0.1101 0.1072 0.1510 0.1384 0.1396 0.1434 0.1157 0.1018 0.1113 0.1093 0.0976 0.1048 0.1184 0.1162 0.1257 0.1447 0.1559 0.1549 0.1571 0.1596
va: 2.1482 2.0784 1.9328 2.0000 3.3218 2.9185 2.9029 3.7979 3.9047 3.9070 3.9108 4.0297 3.5204 3.5581 4.1138 3.9789 3.6069 3.9880 3.9905 3.9005 3.9226 3.8425 3.9596 4.0206 3.8942 3.5764 3.9936 3.8499 3.8582 3.9190 3.7755 1.0025 1.0066 1.0198 1.0068 1.0070 1.0034 1.0212 1.0025 0.9984 1.0151 1.0265 1.0196 1.0024 0.9928 1.0144 0.9900 0.9907 1.0152 1.0295 0.9974 1.0035 0.9863 1.0116 0.9983 0.9938 0.9937 0.9896
dispcorr: -0.034030969 hartree
energy: -1396.080483625007
dipole: 21.05998 -21.07425 -0.01428 -10.70873 9.81785 -0.89088 -7.75929 6.74528 -1.01400
magnitude: 1.34984 au
magnitude: 3.43102 debye
