program: Orca
programVersion: 5.0.2
elementType: O O O O N N N C C C C C C C C C C C C C C C C C C C C C C C C H H H H H H H H H H H H H H H H H H H H H H H H H H H
charge: 0
multiplicity: 1
keywords: wb97x-d3
keywords: def2-TZVPP
keywords: def2/J RIJCOSX
keywords: DEFGRID2
keywords: scfconv7
keywords: smallprint printgap noloewdin
keywords: NOSOSCF
formula: C24H27N3O4
InChI: InChI=1/C24H27N3O4/c1-17-21(22(27(5)26-17)30-20-9-7-6-8-10-20)15-25-29-16-18-11-13-19(14-12-18)23(28)31-24(2,3)4/h6-15H,16H2,1-5H3
58 atoms
O  4.959406 0.181722 0.195079
O  -3.256863 -1.281127 1.195452
O  -1.886512 2.811766 0.187755
O  4.311779 0.250054 -1.954666
N  -5.088709 -1.763146 -0.146823
N  -5.872868 -1.212812 -1.084941
N  -2.475992 1.573669 0.314907
C  6.252532 -0.470979 -0.0054
C  6.060127 -1.869065 -0.574746
C  6.811268 -0.555925 1.407273
C  7.166915 0.383661 -0.871121
C  4.116586 0.463335 -0.777592
C  2.864245 1.083677 -0.273936
C  -4.216413 0.216669 -0.545177
C  -4.098159 -0.938206 0.210145
C  -5.356218 -0.030171 -1.346359
C  0.454812 2.227682 0.5771
C  1.857817 1.381778 -1.189027
C  2.65136 1.355511 1.076965
C  0.665957 1.948226 -0.769445
C  1.456842 1.916383 1.492324
C  -0.788877 2.919165 1.065353
C  -5.955686 0.874931 -2.361544
C  -3.424174 1.419133 -0.521588
C  -5.428953 -3.03353 0.448695
C  -1.910503 -1.428123 0.930328
C  -1.074953 -1.424831 2.037356
C  -1.406358 -1.599442 -0.348707
C  0.28961 -1.587928 1.855698
C  -0.03536 -1.753815 -0.513136
C  0.817717 -1.748493 0.580581
H  7.013024 -2.39801 -0.538505
H  5.343935 -2.439887 0.01825
H  5.728676 -1.864872 -1.611116
H  6.162895 -1.142712 2.059606
H  7.788238 -1.037529 1.38675
H  6.937877 0.434933 1.84631
H  6.867751 0.406663 -1.916722
H  8.175293 -0.029575 -0.829345
H  7.217459 1.408093 -0.499428
H  2.000917 1.173553 -2.2409
H  3.407567 1.130155 1.815719
H  -0.093721 2.176839 -1.504998
H  1.302574 2.117788 2.545649
H  -0.592537 3.990807 1.150338
H  -1.054552 2.560727 2.064239
H  -6.84269 0.424225 -2.803257
H  -6.246967 1.829129 -1.920909
H  -5.252554 1.092423 -3.166477
H  -3.684265 2.197199 -1.238792
H  -4.528563 -3.565396 0.7425
H  -5.959133 -3.62984 -0.287486
H  -6.065143 -2.898274 1.322537
H  -1.489762 -1.291544 3.028492
H  -2.057528 -1.611954 -1.21351
H  0.94293 -1.58151 2.718145
H  0.363121 -1.880411 -1.511075
H  1.884166 -1.866375 0.442027
elementType: O N C H
totalener: -1396.04681065 hartree
nucrepener: 3053.12296887 hartree
electener: -4449.16977952 hartree
oneelecener: -7971.83757830 hartree
twoeener: 3522.66779878 hartree
cpcmener: -0.04246021 hartree
kineticenergy: 1390.01423822 hartree
xcener: -134.852332076672 hartree
chargesum: -0.0000000
charge: -0.290571 -0.334414 -0.261425 -0.503835 0.118021 -0.339636 -0.181845 0.259836 -0.313460 -0.287655 -0.310490 0.544029 -0.021724 -0.126350 0.216629 0.076691 0.049611 -0.152965 -0.171762 -0.230652 -0.208940 0.118443 -0.276880 0.102200 -0.163322 0.332142 -0.269567 -0.166861 -0.138592 -0.197234 -0.160774 0.107655 0.104405 0.101387 0.103268 0.100602 0.104244 0.100654 0.106173 0.105112 0.139386 0.148290 0.141673 0.142502 0.121114 0.102799 0.097000 0.109520 0.110374 0.104570 0.118515 0.114709 0.125377 0.146606 0.154797 0.157896 0.158530 0.164191
qa: -0.2906 -0.3344 -0.2614 -0.5038 0.1180 -0.3396 -0.1818 0.2598 -0.3135 -0.2877 -0.3105 0.5440 -0.0217 -0.1263 0.2166 0.0767 0.0496 -0.1530 -0.1718 -0.2307 -0.2089 0.1184 -0.2769 0.1022 -0.1633 0.3321 -0.2696 -0.1669 -0.1386 -0.1972 -0.1608 0.1077 0.1044 0.1014 0.1033 0.1006 0.1042 0.1007 0.1062 0.1051 0.1394 0.1483 0.1417 0.1425 0.1211 0.1028 0.0970 0.1095 0.1104 0.1046 0.1185 0.1147 0.1254 0.1466 0.1548 0.1579 0.1585 0.1642
va: 2.1579 2.0847 1.9382 2.0028 3.3209 2.9200 2.8952 3.8037 3.9078 3.8991 3.9021 4.0384 3.5351 3.5552 4.1024 3.9785 3.5338 3.9851 3.9739 3.9447 3.9340 3.8452 3.9599 4.0170 3.8948 3.5557 3.9944 3.8448 3.8592 3.8819 3.8063 1.0029 1.0053 1.0202 1.0070 1.0071 1.0067 1.0206 1.0027 1.0058 1.0262 1.0132 1.0194 1.0034 0.9918 1.0163 1.0155 0.9905 0.9905 1.0293 0.9972 1.0048 0.9860 1.0094 0.9991 0.9925 0.9945 0.9832
dispcorr: -0.032893400 hartree
energy: -1396.079704048263
dipole: 25.65247 -25.02197 0.63050 -6.02964 5.60483 -0.42481 -0.14492 1.53687 1.39194
magnitude: 1.58603 au
magnitude: 4.03138 debye
