program: Orca
programVersion: 5.0.2
elementType: O O O O N N N C C C C C C C C C C C C C C C C C C C C C C C C H H H H H H H H H H H H H H H H H H H H H H H H H H H
charge: 0
multiplicity: 1
keywords: wb97x-d3
keywords: def2-TZVPP
keywords: def2/J RIJCOSX
keywords: DEFGRID2
keywords: scfconv7
keywords: smallprint printgap noloewdin
keywords: NOSOSCF
formula: C24H27N3O4
InChI: InChI=1/C24H27N3O4/c1-17-21(22(27(5)26-17)30-20-9-7-6-8-10-20)15-25-29-16-18-11-13-19(14-12-18)23(28)31-24(2,3)4/h6-15H,16H2,1-5H3
58 atoms
O  4.942281 0.155794 0.0432
O  -3.248888 -1.363743 -1.23456
O  -1.870749 2.796562 -0.643804
O  4.083263 0.250865 2.115683
N  -5.057514 -1.725735 0.18083
N  -5.826318 -1.091164 1.077779
N  -2.461384 1.551773 -0.642059
C  6.264262 -0.361049 0.396516
C  6.158787 -1.730483 1.051744
C  7.011874 0.637698 1.267833
C  6.950259 -0.484969 -0.956026
C  3.999331 0.43293 0.920127
C  2.791218 1.013525 0.280079
C  -4.197361 0.290731 0.360625
C  -4.082662 -0.933186 -0.276963
C  -5.315945 0.11592 1.208553
C  0.471749 2.122907 -0.829591
C  1.709097 1.352133 1.087877
C  2.698241 1.223348 -1.095472
C  0.56288 1.904532 0.541076
C  1.547661 1.765636 -1.638836
C  -0.721601 2.787725 -1.45949
C  -5.896895 1.110465 2.14797
C  -3.407794 1.485236 0.207995
C  -5.382839 -3.060774 -0.262016
C  -1.904354 -1.500836 -0.947864
C  -1.422142 -1.634012 0.344174
C  -1.050964 -1.531849 -2.040113
C  -0.05527 -1.791906 0.536269
C  0.309669 -1.695915 -1.830392
C  0.815358 -1.824321 -0.542887
H  5.553262 -2.409864 0.45004
H  7.15825 -2.16044 1.12632
H  5.74495 -1.691873 2.05704
H  8.048965 0.314075 1.362867
H  7.017638 1.62926 0.812801
H  6.602782 0.718377 2.272855
H  7.962056 -0.865834 -0.820763
H  7.022352 0.481215 -1.457683
H  6.418725 -1.17641 -1.611586
H  1.755683 1.188604 2.156148
H  3.513782 0.961615 -1.754876
H  -0.255245 2.167458 1.198077
H  1.486503 1.916488 -2.710026
H  -0.93783 2.333218 -2.431143
H  -0.491083 3.84017 -1.64164
H  -6.206669 2.017461 1.62754
H  -6.76801 0.699143 2.654695
H  -5.173466 1.406255 2.908872
H  -3.661808 2.332144 0.845039
H  -4.475745 -3.615174 -0.486136
H  -6.015123 -3.037082 -1.148437
H  -5.911313 -3.569359 0.538125
H  -2.086659 -1.616362 1.198615
H  -1.447199 -1.421983 -3.041522
H  0.325744 -1.891064 1.54408
H  0.978275 -1.712577 -2.680912
H  1.878541 -1.943672 -0.383095
elementType: O N C H
totalener: -1396.04673734 hartree
nucrepener: 3058.93686762 hartree
electener: -4454.98360496 hartree
oneelecener: -7983.48063626 hartree
twoeener: 3528.49703130 hartree
cpcmener: -0.04251290 hartree
kineticenergy: 1390.01624064 hartree
xcener: -134.852980963437 hartree
chargesum: 0.0000000
charge: -0.291266 -0.336152 -0.262712 -0.504926 0.121579 -0.338816 -0.181176 0.257905 -0.310071 -0.311828 -0.287894 0.548120 -0.018738 -0.110959 0.203531 0.073042 0.052742 -0.161448 -0.169424 -0.223547 -0.214070 0.107692 -0.277423 0.099676 -0.164199 0.328971 -0.163938 -0.274327 -0.191028 -0.134409 -0.160506 0.104157 0.106688 0.101260 0.105844 0.105238 0.101449 0.100652 0.103876 0.103967 0.138921 0.149384 0.143807 0.142312 0.104713 0.122854 0.109388 0.097639 0.110377 0.105021 0.118428 0.125707 0.115100 0.154073 0.146260 0.158437 0.157956 0.162090
qa: -0.2913 -0.3362 -0.2627 -0.5049 0.1216 -0.3388 -0.1812 0.2579 -0.3101 -0.3118 -0.2879 0.5481 -0.0187 -0.1110 0.2035 0.0730 0.0527 -0.1614 -0.1694 -0.2235 -0.2141 0.1077 -0.2774 0.0997 -0.1642 0.3290 -0.1639 -0.2743 -0.1910 -0.1344 -0.1605 0.1042 0.1067 0.1013 0.1058 0.1052 0.1014 0.1007 0.1039 0.1040 0.1389 0.1494 0.1438 0.1423 0.1047 0.1229 0.1094 0.0976 0.1104 0.1050 0.1184 0.1257 0.1151 0.1541 0.1463 0.1584 0.1580 0.1621
va: 2.1587 2.0808 1.9378 2.0017 3.3179 2.9201 2.8883 3.8067 3.9039 3.9049 3.8991 4.0345 3.5252 3.5520 4.1175 3.9790 3.5246 3.9902 3.9738 3.9331 3.9416 3.8611 3.9608 4.0175 3.8941 3.5576 3.8522 3.9940 3.8774 3.8559 3.8100 1.0055 1.0029 1.0210 1.0026 1.0062 1.0202 1.0071 1.0068 1.0070 1.0269 1.0128 1.0169 1.0033 1.0141 0.9916 0.9906 1.0153 0.9904 1.0297 0.9966 0.9861 1.0053 0.9991 1.0095 0.9944 0.9923 0.9859
dispcorr: -0.033156727 hartree
energy: -1396.079894067317
dipole: 26.40021 -25.56929 0.83092 -4.94392 4.53839 -0.40553 2.59169 -3.85258 -1.26089
magnitude: 1.56356 au
magnitude: 3.97426 debye
