program: Orca
programVersion: 5.0.2
elementType: O O O O N N N C C C C C C C C C C C C C C C C C C C C C C C C H H H H H H H H H H H H H H H H H H H H H H H H H H H
charge: 0
multiplicity: 1
keywords: wb97x-d3
keywords: def2-TZVPP
keywords: def2/J RIJCOSX
keywords: DEFGRID2
keywords: scfconv7
keywords: smallprint printgap noloewdin
keywords: NOSOSCF
formula: C24H27N3O4
InChI: InChI=1/C24H27N3O4/c1-17-21(22(27(5)26-17)30-20-9-7-6-8-10-20)15-25-29-16-18-11-13-19(14-12-18)23(28)31-24(2,3)4/h6-15H,16H2,1-5H3
58 atoms
O  4.428537 -0.190941 -0.89224
O  -3.380161 -0.802352 1.441452
O  -1.855687 2.809698 -0.653293
O  4.967051 0.598461 1.139888
N  -4.787554 -1.920011 -0.031074
N  -5.319067 -1.810161 -1.257239
N  -2.433508 1.638379 -0.215854
C  5.649379 -0.956264 -1.143682
C  5.387841 -1.574186 -2.509417
C  5.824062 -2.054206 -0.104542
C  6.856084 -0.032746 -1.217354
C  4.201847 0.501952 0.204507
C  2.877655 1.175287 0.181464
C  -3.903631 -0.096813 -0.886401
C  -3.949352 -0.911961 0.232796
C  -4.790002 -0.728442 -1.789615
C  0.395745 2.472827 0.235342
C  1.992996 1.056538 -0.887734
C  2.503314 1.941189 1.284443
C  0.766115 1.701694 -0.861322
C  1.274931 2.574579 1.311021
C  -0.890563 3.251891 0.27295
C  -5.13438 -0.28861 -3.166508
C  -3.167509 1.11808 -1.117442
C  -5.2068 -2.972913 0.863086
C  -2.006993 -0.894624 1.560921
C  -1.203974 -1.473762 0.592204
C  -1.469162 -0.396198 2.737501
C  0.166686 -1.539692 0.810609
C  -0.10054 -0.477297 2.942358
C  0.724756 -1.046027 1.980399
H  6.243789 -2.179003 -2.807068
H  4.510895 -2.223275 -2.493761
H  5.239221 -0.809423 -3.273162
H  4.916295 -2.651526 -0.007306
H  6.621862 -2.72188 -0.431844
H  6.099051 -1.675091 0.87724
H  7.713668 -0.603988 -1.574722
H  7.127066 0.39501 -0.254275
H  6.685816 0.78019 -1.924557
H  2.247244 0.463229 -1.754999
H  3.166982 2.039328 2.132947
H  0.106148 1.597465 -1.712253
H  0.995244 3.158692 2.179635
H  -0.688247 4.290396 0.000082
H  -1.29878 3.259972 1.288229
H  -4.25215 -0.259553 -3.807162
H  -5.855567 -0.967415 -3.618204
H  -5.56736 0.712477 -3.168412
H  -3.275321 1.581323 -2.09789
H  -5.464923 -3.846133 0.271846
H  -6.074001 -2.668937 1.447999
H  -4.397256 -3.237651 1.53718
H  -1.622386 -1.869458 -0.324547
H  -2.114162 0.053913 3.481494
H  0.799264 -1.982361 0.052547
H  0.321359 -0.08496 3.858252
H  1.793221 -1.099096 2.140103
elementType: O N C H
totalener: -1396.04673574 hartree
nucrepener: 3070.72544381 hartree
electener: -4466.77217955 hartree
oneelecener: -8006.86177945 hartree
twoeener: 3540.08959990 hartree
cpcmener: -0.04219869 hartree
kineticenergy: 1390.01886742 hartree
xcener: -134.853690281680 hartree
chargesum: -0.0000000
charge: -0.289954 -0.335721 -0.262289 -0.508211 0.121910 -0.339075 -0.180516 0.259471 -0.288270 -0.311851 -0.310096 0.549424 -0.013043 -0.119660 0.209194 0.075451 0.048552 -0.202257 -0.134504 -0.211835 -0.218308 0.107350 -0.278270 0.100750 -0.165240 0.340889 -0.176320 -0.283004 -0.181896 -0.121862 -0.172163 0.100672 0.104010 0.103631 0.105414 0.105997 0.101108 0.106318 0.100960 0.104232 0.149979 0.137842 0.143329 0.143075 0.121668 0.104399 0.110654 0.097918 0.109608 0.103687 0.115970 0.125698 0.118916 0.154860 0.146338 0.159012 0.158723 0.157335
qa: -0.2900 -0.3357 -0.2623 -0.5082 0.1219 -0.3391 -0.1805 0.2595 -0.2883 -0.3119 -0.3101 0.5494 -0.0130 -0.1197 0.2092 0.0755 0.0486 -0.2023 -0.1345 -0.2118 -0.2183 0.1073 -0.2783 0.1007 -0.1652 0.3409 -0.1763 -0.2830 -0.1819 -0.1219 -0.1722 0.1007 0.1040 0.1036 0.1054 0.1060 0.1011 0.1063 0.1010 0.1042 0.1500 0.1378 0.1433 0.1431 0.1217 0.1044 0.1107 0.0979 0.1096 0.1037 0.1160 0.1257 0.1189 0.1549 0.1463 0.1590 0.1587 0.1573
va: 2.1650 2.0833 1.9358 1.9952 3.3191 2.9197 2.8906 3.8014 3.9005 3.9021 3.9041 4.0331 3.5421 3.5520 4.1130 3.9789 3.5263 4.0135 3.9530 3.9137 3.9456 3.8609 3.9606 4.0153 3.8940 3.5466 3.8570 4.0070 3.8578 3.8508 3.8241 1.0071 1.0065 1.0069 1.0053 1.0028 1.0209 1.0024 1.0201 1.0066 1.0139 1.0261 1.0157 1.0034 0.9918 1.0135 0.9904 1.0154 0.9903 1.0304 1.0039 0.9861 0.9976 0.9997 1.0096 0.9943 0.9908 0.9896
dispcorr: -0.033203246 hartree
energy: -1396.079938984451
dipole: 22.68434 -22.68528 -0.00094 -10.04692 9.29021 -0.75671 -9.58531 8.72629 -0.85903
magnitude: 1.14479 au
magnitude: 2.90982 debye
