program: Orca
programVersion: 5.0.2
elementType: O O O O N N N C C C C C C C C C C C C C C C C C C C C C C C C H H H H H H H H H H H H H H H H H H H H H H H H H H H
charge: 0
multiplicity: 1
keywords: wb97x-d3
keywords: def2-TZVPP
keywords: def2/J RIJCOSX
keywords: DEFGRID2
keywords: scfconv7
keywords: smallprint printgap noloewdin
keywords: NOSOSCF
formula: C24H27N3O4
InChI: InChI=1/C24H27N3O4/c1-17-21(22(27(5)26-17)30-20-9-7-6-8-10-20)15-25-29-16-18-11-13-19(14-12-18)23(28)31-24(2,3)4/h6-15H,16H2,1-5H3
58 atoms
O  4.408892 0.199972 1.054412
O  -3.297703 -1.234195 -1.233261
O  -1.859238 2.859406 -0.372595
O  4.958117 0.116709 -1.121857
N  -4.78921 -1.835007 0.444444
N  -5.387372 -1.341267 1.537541
N  -2.43108 1.606382 -0.421606
C  5.626122 -0.39743 1.598277
C  5.355852 -0.404098 3.095963
C  6.835364 0.473944 1.291304
C  5.803517 -1.822564 1.095118
C  4.191787 0.405839 -0.228327
C  2.879209 1.055512 -0.47445
C  -3.946556 0.179735 0.707307
C  -3.933475 -0.955212 -0.086013
C  -4.884997 -0.137118 1.717389
C  0.416869 2.263447 -1.032593
C  1.968278 1.310395 0.548032
C  2.54349 1.404567 -1.781156
C  0.750227 1.90948 0.270419
C  1.325381 1.997663 -2.054354
C  -0.865426 2.976387 -1.365382
C  -5.306922 0.721774 2.854166
C  -3.21229 1.410624 0.565213
C  -5.148963 -3.131042 -0.079751
C  -1.924468 -1.373726 -1.228745
C  -1.202157 -1.6480 -0.078914
C  -1.29812 -1.25441 -2.460427
C  0.175975 -1.795844 -0.17231
C  0.07675 -1.41241 -2.536516
C  0.821209 -1.681628 -1.394636
H  6.209883 -0.827869 3.62309
H  5.196623 0.605939 3.476704
H  4.479833 -1.00689 3.340547
H  7.111283 0.463356 0.238868
H  6.663881 1.507137 1.596935
H  7.690295 0.101666 1.856555
H  4.900135 -2.412765 1.255205
H  6.608865 -2.295128 1.658378
H  6.070645 -1.872659 0.041768
H  2.195804 1.044705 1.570808
H  3.232567 1.206426 -2.591074
H  0.065041 2.102931 1.084936
H  1.075821 2.257587 -3.076157
H  -1.243989 2.639957 -2.335327
H  -0.67009 4.048107 -1.450402
H  -5.709525 1.673234 2.504695
H  -6.076945 0.228004 3.444212
H  -4.469588 0.948193 3.515483
H  -3.359787 2.167724 1.334932
H  -5.504046 -3.747542 0.740171
H  -4.281496 -3.611569 -0.52367
H  -5.934532 -3.048542 -0.829648
H  -1.690462 -1.746062 0.882325
H  -1.881286 -1.035663 -3.345938
H  0.744604 -2.002874 0.724693
H  0.569095 -1.314625 -3.495023
H  1.895179 -1.794138 -1.457523
elementType: O N C H
totalener: -1396.04691733 hartree
nucrepener: 3072.26216257 hartree
electener: -4468.30907990 hartree
oneelecener: -8009.99279129 hartree
twoeener: 3541.68371139 hartree
cpcmener: -0.04234210 hartree
kineticenergy: 1390.02550642 hartree
xcener: -134.854678801187 hartree
chargesum: -0.0000000
charge: -0.289101 -0.335686 -0.263338 -0.507969 0.124059 -0.339469 -0.181568 0.256151 -0.287872 -0.311554 -0.310788 0.550029 -0.005898 -0.111780 0.202907 0.073729 0.047577 -0.208836 -0.137481 -0.211305 -0.215140 0.109464 -0.277736 0.100773 -0.165876 0.330005 -0.169307 -0.277421 -0.187748 -0.127957 -0.163760 0.100939 0.104233 0.103521 0.101586 0.104551 0.106338 0.104890 0.106220 0.101152 0.149388 0.137701 0.143240 0.142363 0.104129 0.122652 0.109248 0.097827 0.110415 0.104888 0.115556 0.119115 0.126181 0.154699 0.145879 0.159014 0.158732 0.158439
qa: -0.2891 -0.3357 -0.2633 -0.5080 0.1241 -0.3395 -0.1816 0.2562 -0.2879 -0.3116 -0.3108 0.5500 -0.0059 -0.1118 0.2029 0.0737 0.0476 -0.2088 -0.1375 -0.2113 -0.2151 0.1095 -0.2777 0.1008 -0.1659 0.3300 -0.1693 -0.2774 -0.1877 -0.1280 -0.1638 0.1009 0.1042 0.1035 0.1016 0.1046 0.1063 0.1049 0.1062 0.1012 0.1494 0.1377 0.1432 0.1424 0.1041 0.1227 0.1092 0.0978 0.1104 0.1049 0.1156 0.1191 0.1262 0.1547 0.1459 0.1590 0.1587 0.1584
va: 2.1648 2.0805 1.9360 1.9940 3.3162 2.9218 2.8883 3.8084 3.9001 3.9027 3.9017 4.0243 3.5313 3.5540 4.1187 3.9784 3.5305 4.0165 3.9537 3.9176 3.9466 3.8565 3.9606 4.0170 3.8939 3.5572 3.8549 3.9961 3.8675 3.8515 3.8161 1.0070 1.0070 1.0069 1.0197 1.0065 1.0027 1.0057 1.0028 1.0206 1.0142 1.0262 1.0166 1.0039 1.0141 0.9916 0.9904 1.0152 0.9905 1.0297 1.0052 0.9961 0.9859 0.9993 1.0097 0.9943 0.9914 0.9895
dispcorr: -0.033273239 hartree
energy: -1396.080190571624
dipole: 22.43530 -22.43010 0.00521 -5.61661 5.29080 -0.32581 13.26656 -12.18670 1.07986
magnitude: 1.12795 au
magnitude: 2.86702 debye
