program: Orca
programVersion: 5.0.2
elementType: O O O O N N N C C C C C C C C C C C C C C C C C C C C C C C C H H H H H H H H H H H H H H H H H H H H H H H H H H H
charge: 0
multiplicity: 1
keywords: wb97x-d3
keywords: def2-TZVPP
keywords: def2/J RIJCOSX
keywords: DEFGRID2
keywords: scfconv7
keywords: smallprint printgap noloewdin
keywords: NOSOSCF
formula: C24H27N3O4
InChI: InChI=1/C24H27N3O4/c1-17-21(22(27(5)26-17)30-20-9-7-6-8-10-20)15-25-29-16-18-11-13-19(14-12-18)23(28)31-24(2,3)4/h6-15H,16H2,1-5H3
58 atoms
O  4.431379 -0.197107 -0.516464
O  -2.533978 -1.304882 -0.79644
O  -2.017803 3.068763 -0.597186
O  4.215631 0.591958 1.575818
N  -4.576991 -1.839147 0.192689
N  -5.640035 -1.257958 0.764222
N  -2.429454 1.754635 -0.598593
C  5.600561 -1.045443 -0.293204
C  6.804212 -0.209108 0.115224
C  5.834154 -1.660718 -1.664762
C  5.287838 -2.139801 0.717659
C  3.854229 0.526472 0.420693
C  2.669473 1.25764 -0.093565
C  -4.112194 0.309601 0.23274
C  -3.649841 -0.937121 -0.147801
C  -5.374905 0.032193 0.805878
C  0.332975 2.52558 -0.958157
C  2.388878 1.360623 -1.453106
C  1.779349 1.805294 0.827891
C  1.231014 1.991778 -1.875804
C  0.620934 2.428132 0.401124
C  -0.902813 3.227328 -1.447922
C  -6.335127 1.007474 1.384806
C  -3.494677 1.602388 0.082932
C  -4.556482 -3.259181 -0.068219
C  -1.33918 -1.369663 -0.106818
C  -1.251967 -1.26186 1.271899
C  -0.208441 -1.587152 -0.882108
C  -0.006292 -1.386936 1.87646
C  1.023674 -1.716413 -0.261368
C  1.131488 -1.621024 1.120467
H  6.9705 0.608341 -0.587741
H  6.715955 0.205588 1.117177
H  7.692792 -0.841049 0.101098
H  4.975533 -2.251698 -1.987493
H  6.029589 -0.895718 -2.41761
H  6.699171 -2.322098 -1.6286
H  6.10459 -2.862529 0.713629
H  4.375361 -2.67564 0.449328
H  5.187353 -1.768471 1.735184
H  3.058091 0.943239 -2.192378
H  1.97952 1.727494 1.888152
H  1.017229 2.057168 -2.93568
H  -0.060309 2.835478 1.136928
H  -1.140567 2.906229 -2.46668
H  -0.72869 4.305322 -1.480873
H  -7.239618 0.503781 1.720979
H  -5.9052 1.53274 2.238732
H  -6.622635 1.762792 0.65266
H  -3.983948 2.444764 0.571201
H  -5.151608 -3.759254 0.689592
H  -3.53906 -3.636291 -0.013657
H  -4.968605 -3.482659 -1.051346
H  -2.12775 -1.088703 1.883795
H  -0.295965 -1.659874 -1.958703
H  0.064468 -1.302555 2.952879
H  1.905332 -1.88615 -0.865435
H  2.095542 -1.719927 1.601801
elementType: O N C H
totalener: -1396.04671756 hartree
nucrepener: 3109.01819760 hartree
electener: -4505.06491516 hartree
oneelecener: -8083.69257699 hartree
twoeener: 3578.62766182 hartree
cpcmener: -0.04343047 hartree
kineticenergy: 1390.02862243 hartree
xcener: -134.853987234549 hartree
chargesum: 0.0000000
charge: -0.286668 -0.328830 -0.255570 -0.500513 0.125764 -0.339554 -0.186989 0.264471 -0.304539 -0.288192 -0.332079 0.516955 0.006161 -0.110224 0.201564 0.075225 0.031085 -0.193004 -0.153069 -0.174875 -0.231718 0.115825 -0.278682 0.099209 -0.164003 0.320171 -0.177306 -0.313749 -0.174416 -0.070347 -0.186364 0.104922 0.101514 0.106606 0.105509 0.103667 0.101571 0.116119 0.104420 0.104762 0.147649 0.142123 0.143293 0.139964 0.100596 0.113826 0.097766 0.109563 0.110562 0.104390 0.116501 0.119758 0.126156 0.155653 0.142862 0.159601 0.152940 0.161975
qa: -0.2867 -0.3288 -0.2556 -0.5005 0.1258 -0.3396 -0.1870 0.2645 -0.3045 -0.2882 -0.3321 0.5170 0.0062 -0.1102 0.2016 0.0752 0.0311 -0.1930 -0.1531 -0.1749 -0.2317 0.1158 -0.2787 0.0992 -0.1640 0.3202 -0.1773 -0.3137 -0.1744 -0.0703 -0.1864 0.1049 0.1015 0.1066 0.1055 0.1037 0.1016 0.1161 0.1044 0.1048 0.1476 0.1421 0.1433 0.1400 0.1006 0.1138 0.0978 0.1096 0.1106 0.1044 0.1165 0.1198 0.1262 0.1557 0.1429 0.1596 0.1529 0.1620
va: 2.1397 2.0774 1.9293 1.9987 3.3242 2.9189 2.9065 3.7814 3.9052 3.9089 3.9067 4.0445 3.5163 3.5535 4.1236 3.9780 3.5944 4.0057 3.9582 3.9330 3.9456 3.8428 3.9590 4.0286 3.8941 3.5600 3.8612 4.0258 3.9249 3.7981 3.8228 1.0060 1.0194 1.0028 1.0036 1.0065 1.0068 1.0059 1.0015 1.0193 1.0158 1.0258 1.0022 1.0198 1.0117 0.9931 1.0154 0.9907 0.9903 1.0295 1.0040 0.9958 0.9865 0.9996 1.0144 0.9918 0.9976 0.9879
dispcorr: -0.034731876 hartree
energy: -1396.081449440899
dipole: 21.68901 -21.28710 0.40191 -9.89168 9.01992 -0.87176 -0.10346 -0.93776 -1.04122
magnitude: 1.41621 au
magnitude: 3.59971 debye
