program: Orca
programVersion: 5.0.2
elementType: O O O O N N N C C C C C C C C C C C C C C C C C C C C C C C C H H H H H H H H H H H H H H H H H H H H H H H H H H H
charge: 0
multiplicity: 1
keywords: wb97x-d3
keywords: def2-TZVPP
keywords: def2/J RIJCOSX
keywords: DEFGRID2
keywords: scfconv7
keywords: smallprint printgap noloewdin
keywords: NOSOSCF
formula: C24H27N3O4
InChI: InChI=1/C24H27N3O4/c1-17-21(22(27(5)26-17)30-20-9-7-6-8-10-20)15-25-29-16-18-11-13-19(14-12-18)23(28)31-24(2,3)4/h6-15H,16H2,1-5H3
58 atoms
O  4.355117 0.174378 1.504109
O  -2.038696 -1.426161 0.237144
O  -1.716522 2.817058 -0.66702
O  5.059641 -0.122106 -0.609854
N  -4.124802 -1.846609 1.167643
N  -5.221234 -1.218767 1.606982
N  -2.153024 1.548198 -0.398166
C  5.484969 -0.45469 2.159121
C  6.77346 0.307718 1.87275
C  5.5981 -1.92344 1.76507
C  5.131548 -0.340825 3.63729
C  4.246472 0.272167 0.18572
C  2.973528 0.928389 -0.215478
C  -3.784857 0.276997 0.720661
C  -3.235375 -0.990324 0.642463
C  -5.037718 0.055433 1.340638
C  0.593243 2.115603 -1.084305
C  2.023211 1.36535 0.702983
C  2.727121 1.103024 -1.57477
C  0.84743 1.957483 0.27178
C  1.548628 1.685048 -1.999134
C  -0.669128 2.75175 -1.601763
C  -6.073126 1.068946 1.681636
C  -3.21334 1.532487 0.300235
C  -3.964822 -3.262872 1.370373
C  -1.688307 -1.329808 -1.08966
C  -0.332012 -1.339539 -1.36753
C  -2.627542 -1.269124 -2.105862
C  0.086876 -1.294343 -2.686243
C  -2.19125 -1.212192 -3.421105
C  -0.837272 -1.226926 -3.719331
H  7.573737 -0.091522 2.49748
H  7.085014 0.220589 0.834833
H  6.663542 1.365281 2.116801
H  6.342296 -2.40881 2.39807
H  4.650539 -2.442597 1.916993
H  5.903495 -2.054726 0.730055
H  5.019529 0.701304 3.93888
H  5.920407 -0.78233 4.24604
H  4.201519 -0.863796 3.863975
H  2.193487 1.243277 1.763271
H  3.461024 0.768753 -2.295679
H  0.122799 2.284541 1.004281
H  1.358395 1.78853 -3.061147
H  -0.99417 2.224441 -2.506107
H  -0.473721 3.791175 -1.878403
H  -6.919169 0.589586 2.169633
H  -5.682522 1.830778 2.358199
H  -6.44262 1.581383 0.79214
H  -3.712546 2.451272 0.610384
H  -3.396191 -3.699444 0.553067
H  -4.952972 -3.712011 1.397936
H  -3.452355 -3.47505 2.308771
H  0.3855 -1.359589 -0.557954
H  -3.687153 -1.250919 -1.8845
H  1.146811 -1.298507 -2.901428
H  -2.922121 -1.158897 -4.217254
H  -0.504763 -1.18795 -4.74783
totalener: -1396.02817950 hartree
nucrepener: 3055.49052010 hartree
electener: -4451.51869960 hartree
oneelecener: -7974.90261642 hartree
twoeener: 3523.38391682 hartree
kineticenergy: 1390.11067383 hartree
xcener: -134.863028502815 hartree
chargesum: 0.0000000
charge: -0.276234 -0.312681 -0.228638 -0.392650 0.113003 -0.287842 -0.159177 0.228512 -0.299295 -0.301272 -0.259166 0.467893 -0.048871 -0.095681 0.163065 0.090289 0.086003 -0.164619 -0.146819 -0.148497 -0.182966 0.062600 -0.291151 0.093279 -0.168541 0.318569 -0.221305 -0.144712 -0.103218 -0.134536 -0.152753 0.086608 0.117151 0.093169 0.086825 0.092882 0.117388 0.095975 0.083811 0.094882 0.128217 0.137745 0.112521 0.107341 0.088602 0.105438 0.102909 0.093851 0.101232 0.088380 0.108344 0.116592 0.111899 0.120583 0.124453 0.131491 0.124173 0.124949
qa: -0.2762 -0.3127 -0.2286 -0.3927 0.1130 -0.2878 -0.1592 0.2285 -0.2993 -0.3013 -0.2592 0.4679 -0.0489 -0.0957 0.1631 0.0903 0.0860 -0.1646 -0.1468 -0.1485 -0.1830 0.0626 -0.2912 0.0933 -0.1685 0.3186 -0.2213 -0.1447 -0.1032 -0.1345 -0.1528 0.0866 0.1172 0.0932 0.0868 0.0929 0.1174 0.0960 0.0838 0.0949 0.1282 0.1377 0.1125 0.1073 0.0886 0.1054 0.1029 0.0939 0.1012 0.0884 0.1083 0.1166 0.1119 0.1206 0.1245 0.1315 0.1242 0.1249
va: 2.1505 2.1106 1.9774 2.1146 3.2980 2.9149 2.8893 3.8890 3.9009 3.9013 3.9000 4.1191 3.6861 3.6041 4.1328 3.9240 3.5740 4.0343 3.9962 3.9795 3.9201 3.9369 3.9441 3.9789 3.9089 3.7168 4.0111 3.9156 3.9039 3.9712 3.9481 1.0059 1.0205 1.0096 1.0059 1.0092 1.0205 1.0107 1.0116 1.0107 1.0202 1.0255 1.0240 1.0142 1.0048 0.9918 1.0177 0.9927 0.9909 1.0308 0.9985 1.0067 0.9886 1.0169 1.0079 0.9990 1.0001 1.0005
dispcorr: -0.032215373 hartree
energy: -1396.060394874324
dipole: 17.67266 -17.99112 -0.31846 -4.99889 4.85718 -0.14171 10.66376 -10.35731 0.30645
magnitude: 0.46412 au
magnitude: 1.17971 debye
