program: Gaussian 09
title: 000006657
version: EM64L-G09RevD.01
frameworkgroup: C1[X(C4H9NO2)]
method: RPBEPBE
basis: SDD
operation: Freq
keyword: #pfreq=noraman
keyword: PBEPBE/SDD
title: #p freq=noraman PBEPBE/SDD
converged: YES YES NO NO
title: Mulliken charges:
elementType: O O N C C C C H H H H H H H H H
charge: -0.416569 -0.234209 -0.567864 -0.151555 -0.365337 -0.680016 0.145134 0.238442 0.205124 0.221691 0.203713 0.213264 0.252025 0.279440 0.279679 0.377035
chargesum: 0.00000
title: Mulliken charges with hydrogens summed into heavy atoms:
elementType: O O N C C C C
charge: -0.039533 -0.234209 -0.008745 0.086887 0.061479 -0.011013 0.145134
polarizability: 6.47945923e+01 8.12711474e-01 5.84530371e+01 -1.79688507e+00 2.71834565e+00 4.78717868e+01
1716.lowfreq: -15.5199 0.0005 0.0007 0.0009 4.5685 12.3823 39.9617 93.3057 176.6845
frequency: 39.7355 93.1346 176.6838 211.3435 212.7563 260.9756 313.5563 368.0802 489.9929 583.7447 605.2168 679.2597 694.7402 780.3208 825.0385 906.6814 1004.1213 1023.7123 1030.3960 1076.7822 1153.5916 1208.4050 1228.5067 1285.3490 1297.0088 1326.6944 1362.9106 1382.8233 1466.1723 1468.2025 1489.2738 1650.2694 1655.2882 2980.9407 2983.3003 3031.0128 3049.4069 3074.9244 3097.8899 3448.3631 3499.4782 3571.4717
redmass: 6.0235 2.0889 2.7989 1.2966 1.1537 2.6773 3.1001 3.1789 2.8336 1.4999 2.3921 1.7424 3.2990 1.3189 2.2924 3.2885 1.8073 1.2282 2.6224 2.3683 2.4174 1.6174 1.3555 1.7281 1.3026 1.4224 1.3828 1.2149 1.0668 1.0517 1.0547 1.1534 6.0634 1.0392 1.0591 1.0857 1.0977 1.0999 1.0999 1.0454 1.0640 1.0966
irintensity: 1.2950 0.3973 0.3603 10.7319 33.4170 13.8102 2.4044 26.8547 16.8592 103.8971 27.8146 252.1056 50.2488 13.9169 4.9713 17.9094 19.3069 7.7837 234.0614 18.2624 4.2550 0.6040 1.5228 17.3589 9.9139 1.0304 2.2805 15.1824 5.0770 11.3676 12.9579 10.0274 258.5077 44.1798 12.7031 9.7962 16.9557 55.6506 26.1441 1.3389 10.8904 3.4941
temp: 298.150 k
press: 1.00000 atm
elementType: 8 8 7 6 6 6 6 1 1 1 1 1 1 1 1 1
symmnumber: 1
zpe: 347440.7 jmol-1
zpe.correction: 0.132333 hartree
zpe.thermalcorrener: 0.140924 hartree
zpe.thermalcorrenthalpy: 0.141868 hartree
zpe.thermalcorrgfe: 0.098876 hartree
zpe.sumelectzpe: -362.448401 hartree
zpe.sumelectthermal: -362.439810 hartree
zpe.sumelectthermalent: -362.438866 hartree
zpe.sumelectthermalfe: -362.481858 hartree
dipole: -0.2296 -0.7713 -0.6303
dipole: 1.0222
quadrupole: -43.8983 -41.4469 -42.3580
quadrupole: 2.7936 3.0816 -2.4634
quadrupole: -1.3305 1.1208 0.2097 2.7936 3.0816 -2.4634
hfenergy: -362.580734 hartree
pointgroup: C01 [X(C4H9N1O2)]
dipole: -0.0759367 0.2798085 0.2786866 debye
dipolederiv: -0.4273662 0.2948842 0.2225086 0.2258842 -0.9983427 -0.3394459 0.1803766 -0.29665 -0.526342 -0.7708241 -0.1548085 -0.2686814 0.0361536 -0.6234026 -0.1925602 -0.2168964 -0.3068007 -0.5665861 -0.6858266 0.1767735 -0.0598681 0.1460258 -0.6452222 0.0395229 -0.0248884 0.0027178 -0.191358 0.0079422 -0.0241469 -0.0063318 -0.1700831 0.5542662 -0.0481792 0.0081076 0.0023988 0.1717653 0.0626643 -0.0029309 -0.010693 0.130692 0.0736584 0.0398521 -0.1016455 0.074425 0.1148973 -0.0794212 0.0230213 -0.0228997 -0.0581377 0.0246633 0.0201988 0.0417098 0.0281024 0.0775109 1.0452873 -0.1198627 0.2114795 -0.2930583 1.0244376 0.5876794 0.2455176 0.6651165 0.6269145 0.0852279 0.0167556 -0.0231034 0.0188006 0.0250912 -0.0369637 -0.0102638 -0.041356 -0.1007695 0.0118227 -0.03706 -0.0468368 -0.0211205 0.0587003 -0.0852607 -0.0246377 -0.0418236 -0.1482451 0.0289793 0.0653927 0.0025334 0.0633795 -0.1386182 0.0212651 -0.0073321 -0.0151598 0.0814262 0.0568813 0.007935 -0.0025829 -0.0113687 0.0600109 -0.0886182 -0.0659416 -0.0935585 -0.1485707 -0.0944579 -0.0863159 0.0852009 -0.103353 0.0408061 0.0767846 0.1022481 0.0821512 -0.0005529 0.108005 0.0485085 -0.0137827 0.1155623 -0.0820834 0.0009022 -0.0209653 -0.0080389 0.0927185 0.3256479 -0.0989801 -0.103189 -0.0250852 0.178163 0.0176602 -0.0527623 -0.0328664 0.0667617 0.2128984 -0.1701299 0.1453999 -0.06673 0.1259486 0.0160995 0.0926921 0.0006405 0.139065 0.1125396 0.0609639 -0.1091534 0.0124385 0.3219235 -0.0289369 -0.1453187 -0.0192981 0.3113648 unknown
polarizability: 64.5938102|-1.4823373|57.8942756|2.1160546|3.6673098|48.6313303 unknown
InChI: InChI=1S/C4H9NO2/c1-2-3(5)4(6)7/h3,6H,2,5H2,1H3
charge 0 multiplicity 1
16 atoms
O  -1.572043 1.372882 0.576836
O  -1.954821 -0.429626 -0.839197
N  0.477354 -1.679871 0.159763
C  0.23379 -0.245162 0.341888
C  1.245595 0.603001 -0.489988
C  2.693402 0.40485 -0.002002
C  -1.195807 0.174533 -0.049124
H  0.375218 0.010863 1.408032
H  1.156921 0.30597 -1.554528
H  0.956851 1.66873 -0.422957
H  2.824186 0.80289 1.021952
H  3.407523 0.92853 -0.663305
H  2.944136 -0.669283 0.013805
H  0.25249 -2.00335 -0.788465
H  0.033323 -2.273354 0.867768
H  -2.484119 1.635897 0.274523
