program: Orca
programVersion: 5.0.2
elementType: O O O O N N N C C C C C C C C C C C C C C C C C C C C C C C C H H H H H H H H H H H H H H H H H H H H H H H H H H H
charge: 0
multiplicity: 1
keywords: wb97x-d3
keywords: def2-TZVPP
keywords: def2/J RIJCOSX
keywords: DEFGRID2
keywords: scfconv7
keywords: smallprint printgap noloewdin
keywords: NOSOSCF
formula: C24H27N3O4
InChI: InChI=1/C24H27N3O4/c1-17-21(22(27(5)26-17)30-20-9-7-6-8-10-20)15-25-29-16-18-11-13-19(14-12-18)23(28)31-24(2,3)4/h6-15H,16H2,1-5H3
58 atoms
O  4.285657 0.090019 1.457336
O  -2.001722 -1.429195 0.23829
O  -1.795523 2.872841 -0.508034
O  5.020661 0.014535 -0.665602
N  -4.099727 -1.936214 1.082567
N  -5.230119 -1.356985 1.502411
N  -2.198699 1.577929 -0.321735
C  5.412199 -0.592162 2.06204
C  5.036374 -0.631222 3.538507
C  6.697105 0.205924 1.873997
C  5.544086 -2.01209 1.522147
C  4.192439 0.318639 0.153846
C  2.917391 1.000334 -0.195159
C  -3.821636 0.207306 0.692821
C  -3.225994 -1.038518 0.602688
C  -5.083932 -0.071826 1.269611
C  0.526685 2.23278 -0.967275
C  2.677942 1.299824 -1.533557
C  1.955641 1.338683 0.752807
C  1.492864 1.900631 -1.910863
C  0.775368 1.954473 0.370462
C  -0.739388 2.900193 -1.434085
C  -6.161557 0.897417 1.607446
C  -3.280919 1.495745 0.337344
C  -3.891301 -3.348909 1.266526
C  -1.578781 -1.279393 -1.061719
C  -0.20887 -1.306987 -1.261655
C  -2.455241 -1.153037 -2.12666
C  0.2883 -1.210636 -2.549907
C  -1.940352 -1.046298 -3.410645
C  -0.571822 -1.076393 -3.630715
H  4.109047 -1.183231 3.696736
H  5.820984 -1.123765 4.112579
H  4.908003 0.374216 3.94093
H  7.029458 0.219399 0.839023
H  6.57017 1.23519 2.212722
H  7.489844 -0.241741 2.474935
H  4.596712 -2.547762 1.599553
H  6.277998 -2.556457 2.117848
H  5.872372 -2.034265 0.486069
H  3.420834 1.045154 -2.277296
H  2.120649 1.119774 1.798241
H  1.307113 2.097134 -2.960327
H  0.043157 2.203822 1.12555
H  -1.051424 2.456178 -2.386483
H  -0.552482 3.962258 -1.613116
H  -5.816401 1.650202 2.318235
H  -6.521819 1.424541 0.722825
H  -7.004862 0.376014 2.055611
H  -3.821442 2.383481 0.668051
H  -4.866081 -3.822537 1.329317
H  -3.33716 -3.553571 2.182664
H  -3.344238 -3.766054 0.424408
H  0.459289 -1.383096 -0.41447
H  -3.52556 -1.122264 -1.966869
H  1.358606 -1.228488 -2.703394
H  -2.622172 -0.942087 -4.244531
H  -0.178673 -0.998164 -4.635313
totalener: -1396.02791986 hartree
nucrepener: 3066.51070499 hartree
electener: -4462.53862485 hartree
oneelecener: -7996.96423974 hartree
twoeener: 3534.42561489 hartree
kineticenergy: 1390.11182872 hartree
xcener: -134.863483167943 hartree
chargesum: 0.0000000
charge: -0.276403 -0.311968 -0.228498 -0.392915 0.112681 -0.288818 -0.162255 0.229902 -0.259619 -0.298747 -0.302148 0.471076 -0.035889 -0.106622 0.171777 0.091959 0.082343 -0.172507 -0.172841 -0.155483 -0.144916 0.062229 -0.290693 0.097804 -0.169409 0.333087 -0.234519 -0.155015 -0.089238 -0.132441 -0.158112 0.094857 0.083339 0.096293 0.116378 0.093555 0.086702 0.092831 0.086852 0.117108 0.137212 0.127428 0.104140 0.111603 0.087993 0.104293 0.093118 0.101609 0.103186 0.087724 0.116565 0.111379 0.108613 0.118588 0.124418 0.132099 0.123943 0.124375
qa: -0.2764 -0.3120 -0.2285 -0.3929 0.1127 -0.2888 -0.1623 0.2299 -0.2596 -0.2987 -0.3021 0.4711 -0.0359 -0.1066 0.1718 0.0920 0.0823 -0.1725 -0.1728 -0.1555 -0.1449 0.0622 -0.2907 0.0978 -0.1694 0.3331 -0.2345 -0.1550 -0.0892 -0.1324 -0.1581 0.0949 0.0833 0.0963 0.1164 0.0936 0.0867 0.0928 0.0869 0.1171 0.1372 0.1274 0.1041 0.1116 0.0880 0.1043 0.0931 0.1016 0.1032 0.0877 0.1166 0.1114 0.1086 0.1186 0.1244 0.1321 0.1239 0.1244
va: 2.1480 2.1124 1.9758 2.1142 3.2961 2.9185 2.8901 3.8880 3.8996 3.9016 3.9019 4.1154 3.6634 3.6068 4.1270 3.9224 3.5829 4.0004 4.0253 3.9072 3.9686 3.9357 3.9440 3.9739 3.9089 3.6914 4.0103 3.9181 3.8945 3.9628 3.9452 1.0107 1.0118 1.0107 1.0204 1.0094 1.0058 1.0092 1.0061 1.0204 1.0258 1.0207 1.0152 1.0240 1.0044 0.9914 0.9928 0.9909 1.0176 1.0310 1.0080 0.9884 0.9972 1.0192 1.0088 0.9979 1.0000 1.0006
dispcorr: -0.032483297 hartree
energy: -1396.060403157905
dipole: 17.58431 -17.88976 -0.30545 -5.97013 5.77726 -0.19287 10.09197 -9.77507 0.31689
magnitude: 0.48054 au
magnitude: 1.22143 debye
