program: Orca
programVersion: 5.0.2
elementType: O O O O N N N C C C C C C C C C C C C C C C C C C C C C C C C H H H H H H H H H H H H H H H H H H H H H H H H H H H
charge: 0
multiplicity: 1
keywords: wb97x-d3
keywords: def2-TZVPP
keywords: def2/J RIJCOSX
keywords: DEFGRID2
keywords: scfconv7
keywords: smallprint printgap noloewdin
keywords: NOSOSCF
formula: C24H27N3O4
InChI: InChI=1/C24H27N3O4/c1-17-21(22(27(5)26-17)30-20-9-7-6-8-10-20)15-25-29-16-18-11-13-19(14-12-18)23(28)31-24(2,3)4/h6-15H,16H2,1-5H3
58 atoms
O  4.32227 0.025868 0.638643
O  -2.948428 -1.318573 -0.895969
O  -1.887985 2.911662 -0.568284
O  5.0192 0.404752 -1.465543
N  -4.739702 -1.749512 0.534531
N  -5.546581 -1.1366 1.407622
N  -2.424941 1.65184 -0.514957
C  5.527413 -0.625907 1.11146
C  6.716867 0.326806 1.058938
C  5.800291 -1.909954 0.335257
C  5.188302 -0.957671 2.560085
C  4.189362 0.495601 -0.597825
C  2.866007 1.140099 -0.799326
C  -4.027717 0.326933 0.609836
C  -3.825652 -0.908641 0.025614
C  -5.127817 0.107848 1.473261
C  0.371712 2.305684 -1.29175
C  2.509814 1.522119 -2.089946
C  1.965032 1.352191 0.238952
C  1.2725 2.087158 -2.330654
C  0.733941 1.937155 -0.003606
C  -0.937454 2.983202 -1.597204
C  -5.789984 1.094834 2.369233
C  -3.319768 1.56163 0.382614
C  -4.969473 -3.125836 0.181195
C  -1.6226 -1.428621 -0.539279
C  -1.221432 -1.672802 0.763925
C  -0.696322 -1.339196 -1.565887
C  0.130626 -1.840748 1.031311
C  0.64676 -1.5138 -1.283579
C  1.067384 -1.768125 0.014565
H  7.566169 -0.128592 1.570225
H  7.022743 0.551869 0.039875
H  6.48988 1.263993 1.569616
H  6.094829 -1.719504 -0.693875
H  6.609924 -2.457009 0.820352
H  4.923442 -2.560368 0.332337
H  4.96927 -0.054948 3.131948
H  6.029343 -1.460217 3.037278
H  4.323109 -1.619391 2.623657
H  3.203749 1.362742 -2.904326
H  2.21609 1.056395 1.247394
H  1.002567 2.364122 -3.343595
H  0.052062 2.091984 0.820562
H  -1.351301 2.587739 -2.53138
H  -0.763642 4.052532 -1.745759
H  -6.214792 1.927016 1.805909
H  -6.59581 0.616336 2.921778
H  -5.088361 1.514448 3.092045
H  -3.589352 2.417382 1.002849
H  -4.055263 -3.569162 -0.203952
H  -5.749399 -3.21127 -0.575301
H  -5.28095 -3.664823 1.071483
H  -1.943367 -1.733766 1.568542
H  -1.031413 -1.125914 -2.571855
H  0.447068 -2.030902 2.048623
H  1.372178 -1.431616 -2.081484
H  2.119942 -1.885271 0.233764
totalener: -1396.02829936 hartree
nucrepener: 3096.79058418 hartree
electener: -4492.81888354 hartree
oneelecener: -8057.40219201 hartree
twoeener: 3564.58330847 hartree
kineticenergy: 1390.10630104 hartree
xcener: -134.862766870008 hartree
chargesum: -0.0000000
charge: -0.278286 -0.309987 -0.221009 -0.389119 0.110519 -0.286587 -0.150354 0.214090 -0.292757 -0.302774 -0.257454 0.473944 -0.037789 -0.071455 0.151956 0.090829 0.024571 -0.177501 -0.172610 -0.125325 -0.117311 0.067716 -0.292533 0.079050 -0.168989 0.269855 -0.120656 -0.211342 -0.165648 -0.081977 -0.108565 0.086586 0.117643 0.094676 0.118289 0.091997 0.091437 0.096151 0.085286 0.093253 0.133121 0.123673 0.107411 0.112400 0.088757 0.105640 0.100841 0.103193 0.094920 0.077442 0.108085 0.114679 0.117812 0.127012 0.114040 0.120404 0.122948 0.109801
qa: -0.2783 -0.3100 -0.2210 -0.3891 0.1105 -0.2866 -0.1504 0.2141 -0.2928 -0.3028 -0.2575 0.4739 -0.0378 -0.0715 0.1520 0.0908 0.0246 -0.1775 -0.1726 -0.1253 -0.1173 0.0677 -0.2925 0.0790 -0.1690 0.2699 -0.1207 -0.2113 -0.1656 -0.0820 -0.1086 0.0866 0.1176 0.0947 0.1183 0.0920 0.0914 0.0962 0.0853 0.0933 0.1331 0.1237 0.1074 0.1124 0.0888 0.1056 0.1008 0.1032 0.0949 0.0774 0.1081 0.1147 0.1178 0.1270 0.1140 0.1204 0.1229 0.1098
va: 2.1229 2.1073 1.9825 2.1192 3.3072 2.9039 2.9109 3.8957 3.9014 3.9108 3.9066 4.0899 3.6242 3.5519 4.1559 3.9203 3.6447 4.0333 3.9834 3.9283 3.9284 3.9373 3.9434 4.0082 3.9068 3.7417 3.9058 4.0371 3.9787 3.8864 3.8676 1.0062 1.0197 1.0089 1.0213 1.0063 1.0035 1.0103 1.0121 1.0081 1.0270 1.0232 1.0101 1.0235 1.0117 0.9898 0.9912 1.0179 0.9924 1.0363 1.0012 0.9898 1.0032 1.0050 1.0201 1.0020 1.0010 1.0096
dispcorr: -0.034372726 hartree
energy: -1396.062672082037
dipole: 20.97850 -21.06231 -0.08381 -7.00191 6.62376 -0.37815 11.71768 -11.07230 0.64538
magnitude: 0.75269 au
magnitude: 1.91318 debye
