program: Orca
programVersion: 5.0.2
elementType: O O O O N N N C C C C C C C C C C C C C C C C C C C C C C C C H H H H H H H H H H H H H H H H H H H H H H H H H H H
charge: 0
multiplicity: 1
keywords: wb97x-d3
keywords: def2-TZVPP
keywords: def2/J RIJCOSX
keywords: DEFGRID2
keywords: scfconv7
keywords: smallprint printgap noloewdin
keywords: NOSOSCF
formula: C24H27N3O4
InChI: InChI=1/C24H27N3O4/c1-17-21(22(27(5)26-17)30-20-9-7-6-8-10-20)15-25-29-16-18-11-13-19(14-12-18)23(28)31-24(2,3)4/h6-15H,16H2,1-5H3
58 atoms
O  4.962832 0.217846 0.126909
O  -3.272266 -1.349984 -1.287504
O  -1.877386 2.775248 -0.594518
O  4.063415 0.241677 2.18746
N  -5.008343 -1.777164 0.191607
N  -5.754073 -1.18824 1.13324
N  -2.458532 1.534927 -0.588873
C  6.246717 -0.34272 0.500915
C  6.08289 -1.741019 1.086392
C  6.990139 0.584608 1.455704
C  6.988717 -0.419992 -0.828371
C  3.998901 0.465633 1.006109
C  2.800663 1.056933 0.354511
C  -4.18057 0.24767 0.391157
C  -4.063835 -0.952689 -0.287294
C  -5.265331 0.023383 1.273167
C  0.475078 2.134139 -0.769738
C  1.69454 1.342445 1.14728
C  2.735897 1.319732 -1.012096
C  0.545118 1.878441 0.593281
C  1.582583 1.846588 -1.561458
C  -0.736286 2.758034 -1.411141
C  -5.840765 0.976287 2.261615
C  -3.41589 1.46004 0.242621
C  -5.325156 -3.109344 -0.252332
C  -1.910026 -1.41748 -1.103102
C  -1.141125 -1.419617 -2.255798
C  -1.32354 -1.525814 0.145977
C  0.234897 -1.528955 -2.150763
C  0.05784 -1.625969 0.233643
C  0.842267 -1.630054 -0.907367
H  5.502155 -2.378942 0.417982
H  7.066118 -2.198938 1.204339
H  5.601343 -1.72873 2.060951
H  8.010342 0.221408 1.588231
H  7.051656 1.594992 1.048896
H  6.522902 0.632875 2.436096
H  6.465593 -1.061721 -1.538567
H  7.985952 -0.833136 -0.676778
H  7.100808 0.567427 -1.277883
H  1.737688 1.141267 2.209249
H  3.58033 1.106605 -1.652112
H  -0.299715 2.091674 1.232934
H  1.540827 2.032158 -2.628732
H  -0.9536 2.25557 -2.359628
H  -0.526428 3.807672 -1.634579
H  -6.208141 1.883431 1.779542
H  -6.673944 0.513534 2.786149
H  -5.100724 1.278055 3.004409
H  -3.692164 2.307517 0.871183
H  -5.706324 -3.669769 0.596254
H  -4.433112 -3.599185 -0.633153
H  -6.082299 -3.095168 -1.036325
H  -1.62185 -1.328997 -3.220826
H  -1.924311 -1.518776 1.046449
H  0.837202 -1.52625 -3.049707
H  0.522868 -1.696702 1.207799
H  1.917969 -1.701534 -0.827927
totalener: -1396.02888333 hartree
nucrepener: 3066.07281843 hartree
electener: -4462.10170176 hartree
oneelecener: -7996.09473551 hartree
twoeener: 3533.99303375 hartree
kineticenergy: 1390.10488388 hartree
xcener: -134.863532489183 hartree
chargesum: -0.0000000
charge: -0.279200 -0.313773 -0.226793 -0.391230 0.112069 -0.287191 -0.147374 0.228697 -0.300733 -0.300060 -0.259690 0.477894 -0.048948 -0.106165 0.170744 0.098118 0.078823 -0.148286 -0.163042 -0.158749 -0.174723 0.071768 -0.293362 0.080687 -0.167505 0.322315 -0.246812 -0.129391 -0.100564 -0.150002 -0.110386 0.090872 0.088064 0.117605 0.086530 0.093845 0.117628 0.094121 0.084091 0.095871 0.131668 0.124598 0.116244 0.102987 0.090697 0.108447 0.097817 0.103155 0.097599 0.081064 0.116685 0.107961 0.111696 0.116828 0.124006 0.117853 0.126845 0.118088
qa: -0.2792 -0.3138 -0.2268 -0.3912 0.1121 -0.2872 -0.1474 0.2287 -0.3007 -0.3001 -0.2597 0.4779 -0.0489 -0.1062 0.1707 0.0981 0.0788 -0.1483 -0.1630 -0.1587 -0.1747 0.0718 -0.2934 0.0807 -0.1675 0.3223 -0.2468 -0.1294 -0.1006 -0.1500 -0.1104 0.0909 0.0881 0.1176 0.0865 0.0938 0.1176 0.0941 0.0841 0.0959 0.1317 0.1246 0.1162 0.1030 0.0907 0.1084 0.0978 0.1032 0.0976 0.0811 0.1167 0.1080 0.1117 0.1168 0.1240 0.1179 0.1268 0.1181
va: 2.1375 2.1129 1.9892 2.1165 3.3031 2.9128 2.9119 3.8883 3.9055 3.9033 3.8996 4.0900 3.6372 3.5567 4.1382 3.9190 3.5739 4.0006 4.0041 3.9303 3.9518 3.9323 3.9444 4.0024 3.9091 3.6839 4.0484 3.8862 3.9236 3.9387 3.8804 1.0083 1.0065 1.0209 1.0059 1.0089 1.0203 1.0107 1.0119 1.0105 1.0278 1.0214 1.0220 1.0119 1.0125 0.9890 0.9915 1.0179 0.9916 1.0341 1.0050 1.0005 0.9887 1.0168 1.0084 1.0022 1.0021 1.0023
dispcorr: -0.033505806 hartree
energy: -1396.062389133851
dipole: 26.32494 -25.85009 0.47485 -5.16776 4.89442 -0.27335 2.90149 -3.73462 -0.83313
magnitude: 0.99715 au
magnitude: 2.53455 debye
