program: Orca
programVersion: 5.0.2
elementType: O O O O N N N C C C C C C C C C C C C C C C C C C C C C C C C H H H H H H H H H H H H H H H H H H H H H H H H H H H
charge: 0
multiplicity: 1
keywords: wb97x-d3
keywords: def2-TZVPP
keywords: def2/J RIJCOSX
keywords: DEFGRID2
keywords: scfconv7
keywords: smallprint printgap noloewdin
keywords: NOSOSCF
formula: C24H27N3O4
InChI: InChI=1/C24H27N3O4/c1-17-21(22(27(5)26-17)30-20-9-7-6-8-10-20)15-25-29-16-18-11-13-19(14-12-18)23(28)31-24(2,3)4/h6-15H,16H2,1-5H3
58 atoms
O  4.910586 0.097198 0.09331
O  -3.26927 -1.283498 1.198642
O  -1.889779 2.821306 0.407955
O  4.175529 0.221089 -2.027786
N  -5.003842 -1.756981 -0.267228
N  -5.752086 -1.196555 -1.223972
N  -2.4683 1.580392 0.432058
C  6.193252 -0.511704 -0.198655
C  6.013649 -1.885347 -0.835459
C  6.827036 -0.656818 1.179967
C  7.048647 0.403941 -1.06714
C  4.029984 0.415592 -0.848657
C  2.810777 1.040124 -0.272064
C  -4.183065 0.264627 -0.522262
C  -4.062687 -0.916314 0.188538
C  -5.267709 0.012829 -1.397262
C  0.448748 2.176158 0.707347
C  2.663967 1.294318 1.089263
C  1.76718 1.361619 -1.133312
C  1.492516 1.851044 1.567159
C  0.599352 1.924962 -0.650419
C  -0.780387 2.841774 1.267482
C  -5.849281 0.935332 -2.410785
C  -3.420753 1.482005 -0.402712
C  -5.313641 -3.077112 0.216482
C  -1.909867 -1.377729 1.008425
C  -1.137926 -1.395556 2.15912
C  -1.328648 -1.495706 -0.242286
C  0.235162 -1.532404 2.050541
C  0.050312 -1.622696 -0.333249
C  0.837284 -1.644489 0.80566
H  5.354987 -2.512357 -0.232343
H  5.611093 -1.826424 -1.843611
H  6.981773 -2.385424 -0.890045
H  6.944146 0.312396 1.666317
H  6.225076 -1.294267 1.828819
H  7.815441 -1.107742 1.092087
H  6.662578 0.497485 -2.079042
H  8.059364 -0.001881 -1.130159
H  7.122097 1.400135 -0.628551
H  3.457326 1.050687 1.781608
H  1.873745 1.166417 -2.191891
H  1.386303 2.029572 2.631085
H  -0.197423 2.165343 -1.340481
H  -0.570978 3.901458 1.437876
H  -1.036602 2.396666 2.234591
H  -6.679813 0.452876 -2.921784
H  -6.222662 1.852666 -1.953143
H  -5.111962 1.221821 -3.162308
H  -3.696016 2.31298 -1.053263
H  -4.408202 -3.57931 0.547133
H  -5.756965 -3.639851 -0.599498
H  -6.019636 -3.039724 1.046229
H  -1.61458 -1.297026 3.125406
H  -1.930894 -1.475592 -1.141487
H  0.839844 -1.541297 2.947794
H  0.511075 -1.700491 -1.308904
H  1.911198 -1.737444 0.724416
totalener: -1396.02889342 hartree
nucrepener: 3069.64790379 hartree
electener: -4465.67679722 hartree
oneelecener: -8003.25461426 hartree
twoeener: 3537.57781704 hartree
kineticenergy: 1390.10930970 hartree
xcener: -134.864132863761 hartree
chargesum: -0.0000000
charge: -0.278826 -0.311958 -0.225927 -0.389849 0.112014 -0.287863 -0.147756 0.228601 -0.300421 -0.258966 -0.300352 0.474514 -0.047703 -0.110858 0.173918 0.098739 0.074402 -0.165489 -0.145937 -0.166301 -0.162021 0.077897 -0.292740 0.084110 -0.168303 0.316511 -0.239559 -0.124161 -0.109575 -0.159479 -0.099424 0.090305 0.117285 0.088489 0.095713 0.093862 0.083927 0.117758 0.086821 0.093941 0.123946 0.130903 0.101687 0.116001 0.106318 0.089060 0.102939 0.097756 0.097480 0.079697 0.108583 0.116437 0.111632 0.116898 0.124218 0.116727 0.125719 0.118660
qa: -0.2788 -0.3120 -0.2259 -0.3898 0.1120 -0.2879 -0.1478 0.2286 -0.3004 -0.2590 -0.3004 0.4745 -0.0477 -0.1109 0.1739 0.0987 0.0744 -0.1655 -0.1459 -0.1663 -0.1620 0.0779 -0.2927 0.0841 -0.1683 0.3165 -0.2396 -0.1242 -0.1096 -0.1595 -0.0994 0.0903 0.1173 0.0885 0.0957 0.0939 0.0839 0.1178 0.0868 0.0939 0.1239 0.1309 0.1017 0.1160 0.1063 0.0891 0.1029 0.0978 0.0975 0.0797 0.1086 0.1164 0.1116 0.1169 0.1242 0.1167 0.1257 0.1187
va: 2.1343 2.1141 1.9886 2.1180 3.3021 2.9144 2.9165 3.8877 3.9065 3.8995 3.9035 4.0881 3.6324 3.5616 4.1360 3.9179 3.5888 4.0093 4.0012 3.9410 3.9327 3.9241 3.9438 4.0035 3.9091 3.6895 4.0437 3.8813 3.9290 3.9511 3.8734 1.0081 1.0210 1.0066 1.0106 1.0106 1.0120 1.0202 1.0059 1.0088 1.0218 1.0277 1.0124 1.0232 0.9889 1.0137 1.0180 0.9916 0.9917 1.0344 0.9990 1.0064 0.9884 1.0164 1.0085 1.0029 1.0030 1.0010
dispcorr: -0.033566568 hartree
energy: -1396.062459990971
dipole: 25.88038 -25.47218 0.40819 -6.12643 5.83078 -0.29565 -1.43437 2.29164 0.85727
magnitude: 0.99445 au
magnitude: 2.52770 debye
