program: Gaussian 09
title: 000054761
version: EM64L-G09RevD.01
frameworkgroup: C1[X(C12H22O2)]
method: RPBEPBE
basis: SDD
operation: Freq
keyword: #pfreq=noraman
keyword: PBEPBE/SDD
title: #p freq=noraman PBEPBE/SDD
converged: YES YES NO NO
title: Mulliken charges:
elementType: O O C C C C C C C C C C C C H H H H H H H H H H H H H H H H H H H H H H
charge: -0.256920 -0.258648 -0.360495 -0.375447 -0.353386 -0.460585 -0.354768 -0.186959 -0.695654 -0.176882 -0.453805 -0.298962 0.308766 -0.747706 0.185518 0.192453 0.209220 0.192137 0.189313 0.186524 0.193893 0.212044 0.194397 0.195507 0.223853 0.209391 0.209945 0.215334 0.237988 0.202862 0.220901 0.238385 0.222726 0.246475 0.249581 0.243002
chargesum: 0.00000
title: Mulliken charges with hydrogens summed into heavy atoms:
elementType: O O C C C C C C C C C C C C
charge: -0.256920 -0.258648 0.017477 0.025910 0.022451 -0.054648 0.035136 0.036894 -0.060984 0.061105 -0.030041 0.162150 0.308766 -0.008648
polarizability: 1.68749042e+02 1.01657070e+01 1.30215472e+02 -4.16455208e+00 -4.13886891e-01 1.16666084e+02
1716.lowfreq: -23.2431 -4.3342 -0.0001 0.0006 0.0007 6.3903 11.2366 25.3075 33.4306
frequency: -18.8049 25.0526 33.3016 40.9721 42.9307 52.2626 68.9452 91.3855 110.3622 122.9366 125.2303 131.8711 226.8168 232.3491 246.5718 279.0742 288.6632 332.9520 383.2160 413.4047 434.8454 498.1275 530.9059 566.2177 602.4311 720.7250 731.8960 747.4155 766.9027 793.5924 867.5095 885.4587 890.3716 902.9103 962.2649 969.9977 973.5921 997.0357 1003.9149 1015.0390 1030.1941 1041.7862 1055.2623 1065.6783 1079.3776 1105.1662 1114.4302 1151.5653 1188.7014 1199.6552 1204.2116 1222.9725 1234.2037 1242.9911 1268.1417 1272.2513 1282.6419 1288.4880 1293.8513 1299.5921 1318.7644 1341.9781 1350.7430 1352.5207 1358.0785 1381.0358 1386.1239 1443.5217 1453.0647 1454.7527 1456.6530 1457.6379 1461.7180 1464.9433 1472.8596 1475.7581 1481.1486 1487.8293 1653.0470 1687.1696 2948.6445 2950.2656 2953.5207 2958.8458 2963.4694 2968.0564 2970.8967 2986.1141 2999.8549 3006.2361 3011.9644 3020.6745 3027.0634 3040.1483 3042.1668 3063.3658 3067.4025 3070.1502 3088.2750 3098.2986 3099.5803 3140.8875
redmass: 2.3900 4.2990 1.6151 1.5643 2.8599 4.0423 2.4812 2.5163 3.0605 3.3520 2.0010 2.3297 1.1229 2.6735 3.1901 2.5287 3.3329 2.3994 3.0591 2.8330 3.3221 2.3004 3.0891 3.2707 4.2433 1.0645 1.1522 1.9874 1.8336 1.3481 1.3809 2.1743 2.6519 1.6563 2.4706 1.2401 1.2462 2.0545 2.6055 3.2330 2.7100 1.6481 1.7193 2.3006 2.2031 2.4105 2.3552 2.1122 1.6215 2.7899 1.4786 1.2814 1.2804 1.2527 1.2803 1.1356 1.1008 1.1432 1.2282 1.2083 1.3603 1.4708 1.6674 1.4565 1.2923 1.2549 1.2160 1.1004 1.0630 1.0564 1.0844 1.0854 1.0679 1.0774 1.0751 1.0433 1.0815 1.0887 8.8588 6.5731 1.0613 1.0597 1.0590 1.0640 1.0603 1.0595 1.0364 1.0967 1.0983 1.0378 1.0988 1.0609 1.1029 1.0922 1.1029 1.0928 1.1007 1.0993 1.0902 1.1076 1.0948 1.1021
irintensity: 0.0225 0.2546 1.7058 0.1807 0.0521 1.7887 1.2574 0.2746 3.9777 0.3201 1.0044 0.1034 0.0067 1.8386 0.9454 2.7366 7.3772 2.9956 4.6418 1.5275 2.0893 2.8807 1.4674 8.6777 5.3044 12.2714 0.3524 5.7936 4.0195 5.0335 2.0633 10.2495 11.1630 2.0347 9.2293 39.0046 24.0562 9.0491 48.8041 2.7515 31.6683 9.1718 26.9530 2.8166 0.0913 6.2851 9.8429 3.0119 0.9473 213.2582 31.5397 3.2885 11.6369 5.5105 0.9769 0.0195 0.4777 0.2226 1.1041 1.8835 0.1432 0.1105 0.2252 3.1256 1.6140 54.2466 11.0455 12.3736 22.5712 25.5116 3.8410 7.6734 0.0424 1.3205 1.6521 12.3047 4.2293 22.9758 166.7608 1.0015 10.4620 8.5116 6.8961 29.5313 6.6484 151.3630 39.0131 1.8866 2.2997 2.3970 2.2856 38.9258 6.3423 43.2208 85.8795 30.8551 102.5577 54.8246 23.6951 26.0503 13.2400 9.3279
temp: 298.150 k
press: 1.00000 atm
elementType: 8 8 6 6 6 6 6 6 6 6 6 6 6 6 1 1 1 1 1 1 1 1 1 1 1 1 1 1 1 1 1 1 1 1 1 1
symmnumber: 1
zpe: 826415.3 jmol-1
zpe.correction: 0.314765 hartree
zpe.thermalcorrener: 0.332101 hartree
zpe.thermalcorrenthalpy: 0.333045 hartree
zpe.thermalcorrgfe: 0.266241 hartree
zpe.sumelectzpe: -619.770880 hartree
zpe.sumelectthermal: -619.753544 hartree
zpe.sumelectthermalent: -619.752600 hartree
zpe.sumelectthermalfe: -619.819404 hartree
dipole: 0.4057 -0.7583 -1.6384
dipole: 1.8504
quadrupole: -87.9665 -82.8030 -90.0137
quadrupole: 4.2761 5.6830 -4.9240
quadrupole: -1.0388 4.1247 -3.0860 4.2761 5.6830 -4.9240
hfenergy: -620.0856448 hartree
pointgroup: C01 [X(C12H22O2)]
dipole: 0.1702157 0.213596 0.6748182 debye
polarizability: 168.0357743|-11.8387539|130.8617602|2.6930502|1.1724347|116.7330639 unknown
InChI: InChI=1S/C12H22O2/c1-3-4-5-6-7-8-9-10-11-14-12(2)13/h8-9H,3-7,10-11H2,1-2H3
charge 0 multiplicity 1
36 atoms
O  -4.020478 0.180844 0.560695
O  -3.655418 -0.840688 -1.513198
C  3.409612 -0.54641 -0.250742
C  2.253039 0.326857 0.285358
C  4.807813 -0.008791 0.128253
C  0.853091 -0.22913 -0.090979
C  5.964807 -0.883374 -0.407251
C  -0.282771 0.586771 0.488287
C  7.358559 -0.342783 -0.021165
C  -1.249475 1.209914 -0.234407
C  -2.374547 2.031234 0.3612
C  -3.775833 1.52498 -0.035097
C  -3.881954 -0.928484 -0.285436
C  -4.036175 -2.209161 0.505699
H  3.297148 -1.580878 0.13737
H  3.331541 -0.619971 -1.355715
H  2.350546 1.359138 -0.106803
H  2.331694 0.403453 1.389959
H  4.922532 1.025327 -0.259136
H  4.886644 0.063802 1.23344
H  0.786186 -1.274646 0.28021
H  0.755997 -0.27869 -1.193206
H  5.847848 -1.916932 -0.021645
H  5.886488 -0.953631 -1.511527
H  -0.301066 0.678726 1.587305
H  7.473412 -0.292388 1.07824
H  7.512472 0.677749 -0.420296
H  8.167064 -0.985284 -0.41613
H  -1.246998 1.111627 -1.331013
H  -2.307717 3.083848 0.01065
H  -2.292201 2.051152 1.464084
H  -3.885985 1.451945 -1.131905
H  -4.566846 2.166156 0.388046
H  -4.814188 -2.102975 1.278151
H  -3.082599 -2.43551 1.016801
H  -4.277439 -3.039196 -0.174696
