program: Orca
programVersion: 5.0.2
elementType: O O O O N N N C C C C C C C C C C C C C C C C C C C C C C C C H H H H H H H H H H H H H H H H H H H H H H H H H H H
charge: 0
multiplicity: 1
keywords: wb97x-d3
keywords: def2-TZVPP
keywords: def2/J RIJCOSX
keywords: DEFGRID2
keywords: scfconv7
keywords: smallprint printgap noloewdin
keywords: NOSOSCF
formula: C24H27N3O4
InChI: InChI=1/C24H27N3O4/c1-17-21(22(27(5)26-17)30-20-9-7-6-8-10-20)15-25-29-16-18-11-13-19(14-12-18)23(28)31-24(2,3)4/h6-15H,16H2,1-5H3
58 atoms
O  4.322279 0.026156 -1.041928
O  -3.142637 -0.860924 1.377183
O  -1.908355 3.030496 -0.288174
O  4.635114 0.042532 1.183659
N  -4.554054 -1.880876 -0.15894
N  -5.180042 -1.655071 -1.317657
N  -2.396591 1.7802 -0.018519
C  5.503232 -0.744097 -1.380482
C  6.770525 0.008327 -0.990086
C  5.413765 -0.860373 -2.897263
C  5.453763 -2.133078 -0.752302
C  4.005604 0.353175 0.204257
C  2.750031 1.146037 0.26463
C  -3.881231 0.111815 -0.790547
C  -3.777187 -0.846901 0.200983
C  -4.782835 -0.467253 -1.716448
C  0.346307 2.553577 0.508928
C  2.280544 1.528076 1.516135
C  2.007085 1.47691 -0.866733
C  1.088456 2.218055 1.633858
C  0.819041 2.174637 -0.743382
C  -0.918658 3.355794 0.656118
C  -5.270291 0.11551 -2.996522
C  -3.238285 1.398406 -0.889347
C  -4.820451 -3.08186 0.589436
C  -1.779344 -1.034182 1.437453
C  -1.24123 -1.085715 2.714893
C  -0.974386 -1.181577 0.319808
C  0.118698 -1.295204 2.871633
C  0.386357 -1.385618 0.495823
C  0.940134 -1.448601 1.764364
H  7.638448 -0.513697 -1.39566
H  6.769458 1.016545 -1.406923
H  6.896576 0.077874 0.087594
H  6.268978 -1.416224 -3.281137
H  4.508624 -1.386903 -3.20229
H  5.413001 0.121932 -3.37123
H  6.259043 -2.741994 -1.16607
H  4.512872 -2.634618 -0.98501
H  5.576494 -2.106494 0.327316
H  2.843125 1.261334 2.400359
H  2.351269 1.187052 -1.849771
H  0.721837 2.483499 2.618161
H  0.251791 2.420437 -1.631816
H  -0.707538 4.414917 0.486454
H  -1.309175 3.256276 1.67435
H  -5.7967 1.057583 -2.835278
H  -4.449351 0.314417 -3.687329
H  -5.958078 -0.573818 -3.48186
H  -3.50067 2.025399 -1.742352
H  -5.646434 -2.939492 1.286312
H  -3.937269 -3.385262 1.145746
H  -5.083666 -3.865429 -0.114775
H  -1.888654 -0.965429 3.573682
H  -1.388127 -1.129921 -0.678693
H  0.538185 -1.337066 3.86848
H  1.019189 -1.486595 -0.375807
H  2.004507 -1.596453 1.889321
totalener: -1396.02859936 hartree
nucrepener: 3094.07942198 hartree
electener: -4490.10802134 hartree
oneelecener: -8052.12524471 hartree
twoeener: 3562.01722336 hartree
kineticenergy: 1390.09961657 hartree
xcener: -134.861439517900 hartree
chargesum: -0.0000000
charge: -0.275836 -0.301567 -0.219432 -0.395282 0.115480 -0.290254 -0.148559 0.226476 -0.299058 -0.259027 -0.300859 0.472964 -0.039226 -0.141734 0.197859 0.102002 0.026736 -0.149128 -0.190362 -0.104105 -0.152014 0.089098 -0.291871 0.089278 -0.168009 0.300012 -0.231561 -0.142811 -0.099694 -0.118298 -0.151575 0.087180 0.094254 0.116978 0.084334 0.094459 0.095885 0.088963 0.091461 0.116960 0.131803 0.126060 0.102932 0.114572 0.097482 0.083316 0.097781 0.096878 0.103541 0.076177 0.111177 0.109729 0.116126 0.119501 0.121943 0.122186 0.116587 0.132095
qa: -0.2758 -0.3016 -0.2194 -0.3953 0.1155 -0.2903 -0.1486 0.2265 -0.2991 -0.2590 -0.3009 0.4730 -0.0392 -0.1417 0.1979 0.1020 0.0267 -0.1491 -0.1904 -0.1041 -0.1520 0.0891 -0.2919 0.0893 -0.1680 0.3000 -0.2316 -0.1428 -0.0997 -0.1183 -0.1516 0.0872 0.0943 0.1170 0.0843 0.0945 0.0959 0.0890 0.0915 0.1170 0.1318 0.1261 0.1029 0.1146 0.0975 0.0833 0.0978 0.0969 0.1035 0.0762 0.1112 0.1097 0.1161 0.1195 0.1219 0.1222 0.1166 0.1321
va: 2.1417 2.1227 1.9761 2.1069 3.3111 2.9175 2.9317 3.8887 3.9032 3.9012 3.9035 4.0832 3.6293 3.5559 4.1288 3.9173 3.6868 4.0156 4.0092 3.8984 3.9467 3.9117 3.9411 4.0011 3.9121 3.7163 4.0373 3.9150 3.9396 3.9183 3.9029 1.0058 1.0091 1.0196 1.0117 1.0103 1.0106 1.0067 1.0081 1.0207 1.0289 1.0216 1.0136 1.0244 0.9894 1.0138 0.9915 0.9917 1.0180 1.0355 0.9887 0.9971 1.0065 1.0167 1.0130 1.0004 1.0063 1.0029
dispcorr: -0.033766455 hartree
energy: -1396.062365818475
dipole: 22.23030 -22.13904 0.09126 -8.69408 8.44806 -0.24602 -11.14678 10.65627 -0.49051
magnitude: 0.55629 au
magnitude: 1.41397 debye
