program: Orca
programVersion: 5.0.2
elementType: O O O O N N N C C C C C C C C C C C C C C C C C C C C C C C C H H H H H H H H H H H H H H H H H H H H H H H H H H H
charge: 0
multiplicity: 1
keywords: wb97x-d3
keywords: def2-TZVPP
keywords: def2/J RIJCOSX
keywords: DEFGRID2
keywords: scfconv7
keywords: smallprint printgap noloewdin
keywords: NOSOSCF
formula: C24H27N3O4
InChI: InChI=1/C24H27N3O4/c1-17-21(22(27(5)26-17)30-20-9-7-6-8-10-20)15-25-29-16-18-11-13-19(14-12-18)23(28)31-24(2,3)4/h6-15H,16H2,1-5H3
58 atoms
O  4.485977 -0.171426 -0.971094
O  -3.407952 -0.920648 1.42112
O  -1.826669 2.763002 -0.475415
O  5.063663 0.561579 1.072395
N  -4.867092 -1.908785 -0.083251
N  -5.436764 -1.713729 -1.277861
N  -2.415516 1.577489 -0.124287
C  5.72714 -0.861851 -1.261614
C  6.897203 0.114464 -1.299978
C  5.488578 -1.433388 -2.654217
C  5.966077 -1.996494 -0.27131
C  4.278182 0.486199 0.162748
C  2.937852 1.129577 0.194399
C  -3.980428 -0.046862 -0.840198
C  -4.001496 -0.930836 0.224743
C  -4.910166 -0.60657 -1.750291
C  0.436806 2.374439 0.372191
C  2.033071 1.055257 -0.859886
C  2.577678 1.830825 1.342256
C  0.79656 1.67414 -0.7718
C  1.340397 2.43778 1.428429
C  -0.867099 3.120087 0.48439
C  -5.310487 -0.073405 -3.081278
C  -3.229293 1.170483 -1.010675
C  -5.279813 -3.012011 0.744535
C  -2.035998 -0.966468 1.517826
C  -1.2202 -1.413775 0.493151
C  -1.504166 -0.577146 2.736363
C  0.151458 -1.458958 0.697906
C  -0.134116 -0.637298 2.926532
C  0.701506 -1.075657 1.909643
H  7.779846 -0.397173 -1.686543
H  6.684069 0.949739 -1.968937
H  7.143599 0.510112 -0.318036
H  6.370829 -1.978042 -2.990133
H  4.6460 -2.12603 -2.660203
H  5.28744 -0.643481 -3.378775
H  5.095467 -2.651778 -0.214046
H  6.196694 -1.636218 0.72783
H  6.807843 -2.601108 -0.612155
H  2.2890 0.515319 -1.76086
H  3.27226 1.890935 2.169073
H  0.111356 1.60651 -1.605439
H  1.071593 2.969179 2.334152
H  -0.685724 4.186178 0.321653
H  -1.27485 3.006062 1.494179
H  -5.752684 0.920657 -2.997446
H  -4.458923 0.004493 -3.759008
H  -6.04691 -0.730293 -3.539537
H  -3.390139 1.730936 -1.932532
H  -4.462627 -3.324549 1.389142
H  -5.558873 -3.836813 0.095564
H  -6.135485 -2.743397 1.364236
H  -1.636609 -1.712427 -0.460302
H  -2.161685 -0.226801 3.52101
H  0.794335 -1.794401 -0.104755
H  0.283984 -0.330888 3.876272
H  1.771539 -1.109101 2.058684
totalener: -1396.02877364 hartree
nucrepener: 3068.35228986 hartree
electener: -4464.38106350 hartree
oneelecener: -8000.60177860 hartree
twoeener: 3536.22071510 hartree
kineticenergy: 1390.10564459 hartree
xcener: -134.863611855880 hartree
chargesum: -0.0000000
charge: -0.277879 -0.313537 -0.226317 -0.394257 0.110477 -0.288630 -0.148314 0.230821 -0.300998 -0.259334 -0.301384 0.479970 -0.046475 -0.120676 0.184322 0.099261 0.078710 -0.193391 -0.124866 -0.157503 -0.174576 0.074742 -0.293084 0.086833 -0.167960 0.335130 -0.143755 -0.251814 -0.134058 -0.094295 -0.129750 0.086828 0.093884 0.117518 0.083692 0.094152 0.095493 0.091757 0.117528 0.087667 0.126735 0.130946 0.114268 0.104747 0.107151 0.090156 0.098511 0.096627 0.103669 0.078638 0.108508 0.116283 0.111517 0.122844 0.117233 0.120006 0.120796 0.125433
qa: -0.2779 -0.3135 -0.2263 -0.3943 0.1105 -0.2886 -0.1483 0.2308 -0.3010 -0.2593 -0.3014 0.4800 -0.0465 -0.1207 0.1843 0.0993 0.0787 -0.1934 -0.1249 -0.1575 -0.1746 0.0747 -0.2931 0.0868 -0.1680 0.3351 -0.1438 -0.2518 -0.1341 -0.0943 -0.1297 0.0868 0.0939 0.1175 0.0837 0.0942 0.0955 0.0918 0.1175 0.0877 0.1267 0.1309 0.1143 0.1047 0.1072 0.0902 0.0985 0.0966 0.1037 0.0786 0.1085 0.1163 0.1115 0.1228 0.1172 0.1200 0.1208 0.1254
va: 2.1463 2.1164 1.9888 2.1106 3.3039 2.9154 2.9172 3.8847 3.9027 3.9012 3.9017 4.0907 3.6452 3.5594 4.1288 3.9191 3.5766 4.0062 3.9908 3.9372 3.9412 3.9278 3.9439 3.9987 3.9096 3.6720 3.8941 4.0545 3.9210 3.9201 3.9021 1.0057 1.0092 1.0200 1.0119 1.0104 1.0106 1.0088 1.0208 1.0061 1.0208 1.0280 1.0228 1.0122 0.9887 1.0132 0.9911 0.9918 1.0179 1.0347 0.9998 1.0057 0.9885 1.0097 1.0169 1.0043 1.0011 0.9975
dispcorr: -0.033290160 hartree
energy: -1396.062063802524
dipole: 22.69974 -22.76137 -0.06163 -9.00505 8.61013 -0.39491 -10.11938 9.72532 -0.39407
magnitude: 0.56129 au
magnitude: 1.42668 debye
